{"text_format":"1","workbook":"xlsx","n_sheets":9,"sheets":["Cuadros","Consolidado","SolCotizacion","Tienda Móvil","Lugar de Entrega","ResumenCotizacion","LISTAS","Cotizacion","CSV"],"not_rendered":{"charts":0,"images":0,"macros":1,"external_links":0,"defined_names":12,"comments":0,"pivot_tables":0},"unopened":[],"bounds":{"document_bytes":16777216,"sheet_cells":100000,"rows_first":2000,"rows_last":500,"rows_between":2000,"halvings":0,"cell_chars":16384,"cell_head_chars":4096},"cells_cut":0,"cells_raw":0,"read":"whole","date_system":"1900"}

{"sheet":"Cuadros","index":0,"n_rows":21,"n_cols":4,"rows_kept":21,"cut":false,"hidden":true,"merged":[]}
["Ropa Dama","Clima Frío","Kit Clásico Clima Frío","Sastre de dos (2) piezas (chaqueta, falda y/o pantalón)\nBlusa formal manga larga"]
["Ropa Dama","Clima Frío","Kit Formal 1 Clima Frío","Chaqueta casual - Pantalón formal\nBlusa sport o de moda, o blusa formal manga larga"]
["Ropa Dama","Clima Frío","Kit Formal 2 Clima Frío","Gabán o abrigo - Pantalón formal\nBlusa sport o de moda, o blusa formal manga larga"]
["Ropa Dama","Clima Frío","Kit Sport Clima Frío","Chaqueta casual o chaqueta de jean - Jean clásico o de moda\nBlusa sport o de moda, o blusa formal manga larga, o camiseta tipo polo"]
["Ropa Dama","Clima Frío","Kit Dotación Clima Frío","Kit clásico, formal 1, formal 2 o sport"]
["Ropa Dama","Clima Cálido","Kit Clásico Clima Cálido","Pantalón o falda de sastre\nBlusa formal manga corta o manga larga"]
["Ropa Dama","Clima Cálido","Kit Formal Clima Cálido","Blusa sport o de moda; o blusa formal manga corta o manga larga\nPantalón formal"]
["Ropa Dama","Clima Cálido","Kit Sport Clima Cálido","Blusa sport o de moda, o blusa formal manga corta, o camiseta tipo polo.\nJean clásico o de moda"]
["Ropa Dama","Clima Cálido","Kit Dotación Clima Cálido","Kit clásico, formal o sport"]
["Ropa Caballero","Clima Frío","Kit Clásico 1 Clima Frío","Vestido formal de dos (2) piezas (saco y pantalón) gama alta\nCamisa formal - Corbata"]
["Ropa Caballero","Clima Frío","Kit Clásico 2 Clima Frío","Vestido formal de dos (2) piezas (saco y pantalón) gama media\nCamisa formal - Corbata"]
["Ropa Caballero","Clima Frío","Kit Formal 1 Clima Frío","Blazer de moda - Pantalón formal en drill\nCamisa sport o informal, o camisa formal"]
["Ropa Caballero","Clima Frío","Kit Formal 2 Clima Frío","Chaqueta drill - Pantalón formal en drill\nCamisa sport o informal, o camisa formal"]
["Ropa Caballero","Clima Frío","Kit Sport Clima Frío","Chaqueta de jean, o chaqueta en drill - Jean clásico o de moda\nCamisa sport o informal, camiseta tipo polo o camisa formal"]
["Ropa Caballero","Clima Frío","Kit Ropa Interior Clima Frío","Camiseta tipo t-shirt blanca - Bóxer - Calcetín para calzado deportivo\nCamiseta tipo t-shirt estampada - Calcetín para calzado de calle"]
["Ropa Caballero","Clima Frío","Kit Dotación Clima Frío","Kit clásico 1, formal 1, formal 2 o sport"]
["Ropa Caballero","Clima Cálido","Kit Clásico Clima Cálido","Pantalón de vestido\nCamisa formal manga corta"]
["Ropa Caballero","Clima Cálido","Kit Formal Clima Cálido","Camisa sport o informal \nPantalón formal en drill"]
["Ropa Caballero","Clima Cálido","Kit Sport Clima Cálido","Camisa sport o informal, o camiseta tipo polo\nJean clásico o de moda"]
["Ropa Caballero","Clima Cálido","Kit Ropa Interior Clima Cálido","Camiseta tipo t-shirt blanca - Bóxer - Calcetín para calzado de calle\nCamiseta tipo t-shirt estampada - Calcetín para calzado deportivo"]
["Ropa Caballero","Clima Cálido","Kit Dotación Clima Cálido"," Kit clásico, formal o sport"]

{"sheet":"Consolidado","index":1,"n_rows":518,"n_cols":51,"rows_kept":518,"cut":false,"hidden":true,"merged":[]}
["Segmento","Descripción","Categoria","Zona","Unidad","Celmy LTDA.","Yubarta S.A.S.","Inversiones Sarhem de Colombia S.A.S.","Confecciones Paez S.A.","C.I Warriors Company S.A.S.","Unón Temporal Dotación 2019","Vanegas Vallejo Inversores S.A.S.","Grupo Fracotex S.A.S.","Crisalltex S.A.","Éxito Industrias S.A.S.","Unión Temporal Color y moda","Permoda LTDA.","NCS MODA S.A.S","Unión Temporal Hermanos Blanco ","Unión Temporal Vestuario 2019 ","Degerard MG S.A.S.","Dotación Integral S.A.S. ","Bacet Group S.A.S. ","Unión Temporal Calzado 2019","Sparta Shoes S.A.S.","Luz Mila Pérez",null,null,"c","Menor","Celmy LTDA.","Yubarta S.A.S.","Inversiones Sarhem de Colombia S.A.S.","Confecciones Paez S.A.","C.I Warriors Company S.A.S.","Unón Temporal Dotación 2019","Vanegas Vallejo Inversores S.A.S.","Grupo Fracotex S.A.S.","Crisalltex S.A.","Éxito Industrias S.A.S.","Unión Temporal Color y moda","Permoda LTDA.","NCS MODA S.A.S","Unión Temporal Hermanos Blanco ","Unión Temporal Vestuario 2019 ","Degerard MG S.A.S.","Dotación Integral S.A.S. ","Bacet Group S.A.S. ","Unión Temporal Calzado 2019","Sparta Shoes S.A.S.","Luz Mila Pérez"]
["Ropa Dama","Sastre formal de dos piezas para dama: chaqueta y falda o pantalón (Opción Uno).",1,1,{"$f":"ROUND(AVERAGE(IF(F2:Z2>-1,F2:Z2)),0)","v":226009},241757.10959400001,213499.78509600001,209514.77779499997,228232.23632999999,227024.65836,-1,247125.135438,-1,-1,-1,-1,-1,-1,-1,214912.423476,-1,-1,-1,-1,-1,-1,null,null,{"$f":"A2&B2&C2&D2","v":"Ropa DamaSastre formal de dos piezas para dama: chaqueta y falda o pantalón (Opción Uno).11"},{"$f":"MIN(IF(AE2:AY2>-1,AE2:AY2))","v":9677046.8203919996},{"$f":"SUM(IF($AA:$AA=1,F:F*AB:AB,0))","v":-98},{"$f":"SUM(IF($AA:$AA=1,G:G*AB:AB,0))","v":-98},{"$f":"SUM(IF($AA:$AA=1,H:H*AB:AB,0))","v":9677046.8203919996},{"$f":"SUM(IF($AA:$AA=1,I:I*AB:AB,0))","v":9683809.2570239976},{"$f":"SUM(IF($AA:$AA=1,J:J*AB:AB,0))","v":-98},{"$f":"SUM(IF($AA:$AA=1,K:K*AB:AB,0))","v":-98},{"$f":"SUM(IF($AA:$AA=1,L:L*AB:AB,0))","v":-98},{"$f":"SUM(IF($AA:$AA=1,M:M*AB:AB,0))","v":-98},{"$f":"SUM(IF($AA:$AA=1,N:N*AB:AB,0))","v":-98},{"$f":"SUM(IF($AA:$AA=1,O:O*AB:AB,0))","v":-98},{"$f":"SUM(IF($AA:$AA=1,P:P*AB:AB,0))","v":-98},{"$f":"SUM(IF($AA:$AA=1,Q:Q*AB:AB,0))","v":-98},{"$f":"SUM(IF($AA:$AA=1,R:R*AB:AB,0))","v":-98},{"$f":"SUM(IF($AA:$AA=1,S:S*AB:AB,0))","v":10887522.97752},{"$f":"SUM(IF($AA:$AA=1,T:T*AB:AB,0))","v":-98},{"$f":"SUM(IF($AA:$AA=1,U:U*AB:AB,0))","v":-98},{"$f":"SUM(IF($AA:$AA=1,V:V*AB:AB,0))","v":15372709.073693998},{"$f":"SUM(IF($AA:$AA=1,W:W*AB:AB,0))","v":11726789.666669998},{"$f":"SUM(IF($AA:$AA=1,X:X*AB:AB,0))","v":9937138.6090889983},{"$f":"SUM(IF($AA:$AA=1,Y:Y*AB:AB,0))","v":12140988.910379998},{"$f":"SUM(IF($AA:$AA=1,Z:Z*AB:AB,0))","v":-98}]
["Ropa Dama","Sastre formal de dos piezas para dama: chaqueta y falda o pantalón (Opción Dos).",1,1,{"$f":"ROUND(AVERAGE(IF(F3:Z3>-1,F3:Z3)),0)","v":204702},179192.03927849996,210987.79507349999,207099.621855,202873.09895999997,202873.09895999997,-1,215552.66764499998,-1,-1,-1,-1,-1,-1,-1,214332.55820549998,-1,-1,-1,-1,-1,-1,null,null,"Ropa DamaSastre formal de dos piezas para dama: chaqueta y falda o pantalón (Opción Dos).11"]
["Ropa Dama","Sastre formal de tres piezas para dama: chaqueta, chaleco y falda o pantalón.",1,1,{"$f":"ROUND(AVERAGE(IF(F4:Z4>-1,F4:Z4)),0)","v":292079},363964.00015799998,270014.43409199995,265063.36441499996,295856.60265000002,265667.15339999995,-1,316989.21712500002,-1,-1,-1,-1,-1,-1,-1,266995.48916699993,-1,-1,-1,-1,-1,-1,null,null,"Ropa DamaSastre formal de tres piezas para dama: chaqueta, chaleco y falda o pantalón.11",null,{"$f":"ROW(AE2)","v":2}]
["Ropa Dama","Blazer para dama.",1,1,{"$f":"ROUND(AVERAGE(IF(F5:Z5>-1,F5:Z5)),0)","v":180360},164314.906533,194661.568764,191401.10824499998,199250.36504999999,147324.51233999999,-1,171174.17724749999,-1,-1,-1,-1,-1,-1,-1,194396.12945549999,-1,-1,-1,-1,-1,-1,null,null,"Ropa DamaBlazer para dama.11",null,{"$f":"COLUMN(AE2)","v":31},null,null,null,null,null,null,null,null,null,null,null,null,null,null,{"$f":"COLUMN(AT2)","v":46}]
["Ropa Dama","Blusa formal manga larga para dama.",1,1,{"$f":"ROUND(AVERAGE(IF(F6:Z6>-1,F6:Z6)),0)","v":69987},63494.677507499997,71023.812227999995,69435.733274999991,69435.733274999991,57963.742559999999,-1,87489.023926499984,-1,-1,-1,-1,-1,-1,-1,71065.963534499984,-1,-1,-1,-1,-1,-1,null,null,"Ropa DamaBlusa formal manga larga para dama.11"]
["Ropa Dama","Blusa formal manga corta para dama.",1,1,{"$f":"ROUND(AVERAGE(IF(F7:Z7>-1,F7:Z7)),0)","v":66479},62166.341740499993,68509.543756500003,67020.577334999994,67020.577334999994,55548.586620000002,-1,78613.325846999986,-1,-1,-1,-1,-1,-1,-1,66477.167248500002,-1,-1,-1,-1,-1,-1,null,null,"Ropa DamaBlusa formal manga corta para dama.11"]
["Ropa Dama","Blusa sport o informal para dama.",1,1,{"$f":"ROUND(AVERAGE(IF(F8:Z8>-1,F8:Z8)),0)","v":68360},74386.802951999998,67639.176238499989,67020.577334999994,65812.999364999996,57963.742559999999,-1,78613.325846999986,-1,-1,-1,-1,-1,-1,-1,67080.956233499994,-1,-1,-1,-1,-1,-1,null,null,"Ropa DamaBlusa sport o informal para dama.11"]
["Ropa Dama","Blusa para dama.",1,1,{"$f":"ROUND(AVERAGE(IF(F9:Z9>-1,F9:Z9)),0)","v":66403},55790.102213999999,72840.875305499983,71850.889215000003,70884.826839000001,57963.742559999999,-1,69737.627767499987,-1,-1,-1,-1,-1,-1,-1,65752.620466499997,-1,-1,-1,-1,-1,-1,null,null,"Ropa DamaBlusa para dama.11"]
["Ropa Dama","Chaqueta casual o sport.",1,1,{"$f":"ROUND(AVERAGE(IF(F10:Z10>-1,F10:Z10)),0)","v":123071},110118.57939449999,114284.72339099999,111700.96222499998,119550.21902999999,135248.73264,-1,154690.73795699998,-1,-1,-1,-1,-1,-1,-1,115903.56140549999,-1,-1,-1,-1,-1,-1,null,null,"Ropa DamaChaqueta casual o sport.11"]
["Ropa Dama","Chaqueta de jean",1,1,{"$f":"ROUND(AVERAGE(IF(F11:Z11>-1,F11:Z11)),0)","v":125015},159400.29203999997,113029.29799199999,138267.67756499999,107474.43932999999,123172.95294,-1,96364.722005999982,-1,-1,-1,-1,-1,-1,-1,137398.44927149999,-1,-1,-1,-1,-1,-1,null,null,"Ropa DamaChaqueta de jean11"]
["Ropa Dama","Falda",1,1,{"$f":"ROUND(AVERAGE(IF(F12:Z12>-1,F12:Z12)),0)","v":72584},85013.489088000002,69073.459883999996,68228.155304999993,67020.577334999994,60378.898499999996,-1,88756.980794999996,-1,-1,-1,-1,-1,-1,-1,69616.869970499989,-1,-1,-1,-1,-1,-1,null,null,"Ropa DamaFalda11"]
["Ropa Dama","Gabán o abrigo para dama",1,1,{"$f":"ROUND(AVERAGE(IF(F13:Z13>-1,F13:Z13)),0)","v":201510},236443.76652599999,214755.21049499998,210722.35576499999,206495.83286999998,193212.47519999999,-1,139475.25553499997,-1,-1,-1,-1,-1,-1,-1,209466.93036599999,-1,-1,-1,-1,-1,-1,null,null,"Ropa DamaGabán o abrigo para dama11"]
["Ropa Dama","Pantalón formal",1,1,{"$f":"ROUND(AVERAGE(IF(F14:Z14>-1,F14:Z14)),0)","v":84777},86341.824854999999,83417.435563499996,81511.512975000005,81994.544162999999,74869.834139999992,-1,100168.59261149999,-1,-1,-1,-1,-1,-1,-1,85134.246884999986,-1,-1,-1,-1,-1,-1,null,null,"Ropa DamaPantalón formal11"]
["Ropa Dama","Pantalón drill formal",1,1,{"$f":"ROUND(AVERAGE(IF(F15:Z15>-1,F15:Z15)),0)","v":80054},85013.489088000002,75352.865327999985,74266.045155,72333.920402999996,96606.237599999993,-1,82417.196452499993,-1,-1,-1,-1,-1,-1,-1,74386.802951999998,-1,-1,-1,-1,-1,-1,null,null,"Ropa DamaPantalón drill formal11"]
["Ropa Dama","Jean clásico",1,1,{"$f":"ROUND(AVERAGE(IF(F16:Z16>-1,F16:Z16)),0)","v":71977},86341.824854999999,60282.064417499991,59775.109514999996,58157.410724999994,96606.237599999993,-1,82417.196452499993,-1,-1,-1,-1,-1,-1,-1,60258.14070299999,-1,-1,-1,-1,-1,-1,null,null,"Ropa DamaJean clásico11"]
["Ropa Dama","Jean informal",1,1,{"$f":"ROUND(AVERAGE(IF(F17:Z17>-1,F17:Z17)),0)","v":89442},126191.89786499999,72840.875305499983,71850.889215000003,69918.764463,106266.86135999998,-1,107776.33382249999,-1,-1,-1,-1,-1,-1,-1,71247.100229999996,-1,-1,-1,-1,-1,-1,null,null,"Ropa DamaJean informal11"]
["Ropa Dama","Camisa tipo polo",1,1,{"$f":"ROUND(AVERAGE(IF(F18:Z18>-1,F18:Z18)),0)","v":36564},38521.737242999996,31397.027219999996,30793.238235000001,30793.238235000001,43472.806919999995,-1,49450.317871499996,-1,-1,-1,-1,-1,-1,-1,31517.785016999998,-1,-1,-1,-1,-1,-1,null,null,"Ropa DamaCamisa tipo polo11"]
["Ropa Dama","Camiseta tipo T-shirt básica",1,1,{"$f":"ROUND(AVERAGE(IF(F19:Z19>-1,F19:Z19)),0)","v":20592},17932.532854500001,16326.226309499998,16302.302594999997,15577.755812999998,28981.871279999999,-1,32840.424661499994,-1,-1,-1,-1,-1,-1,-1,16181.544797999999,-1,-1,-1,-1,-1,-1,null,null,"Ropa DamaCamiseta tipo T-shirt básica11"]
["Ropa Dama","Bata o blusa labor",1,1,{"$f":"ROUND(AVERAGE(IF(F20:Z20>-1,F20:Z20)),0)","v":41790},46491.751844999999,31397.027219999996,32000.816204999996,30068.691452999996,43472.806919999995,-1,74683.001321999996,-1,-1,-1,-1,-1,-1,-1,34415.972145,-1,-1,-1,-1,-1,-1,null,null,"Ropa DamaBata o blusa labor11"]
["Ropa Dama","Pashmina",1,1,{"$f":"ROUND(AVERAGE(IF(F21:Z21>-1,F21:Z21)),0)","v":29085},11955.021902999999,25117.621775999996,25962.926354999996,24151.559399999998,28981.871279999999,-1,58326.015950999994,-1,-1,-1,-1,-1,-1,-1,29102.629076999998,-1,-1,-1,-1,-1,-1,null,null,"Ropa DamaPashmina11"]
["Ropa Dama","Vestido",1,1,{"$f":"ROUND(AVERAGE(IF(F22:Z22>-1,F22:Z22)),0)","v":151361},96968.510990999988,163264.54154399998,160004.08102499999,158796.50305499998,156985.1361,-1,164834.39290499999,-1,-1,-1,-1,-1,-1,-1,158675.74525800001,-1,-1,-1,-1,-1,-1,null,null,"Ropa DamaVestido11"]
["Ropa Dama","Logo corporativo (tamaño bolsillo)",1,1,{"$f":"ROUND(AVERAGE(IF(F23:Z23>-1,F23:Z23)),0)","v":7459},4830.3118799999993,6279.4054439999991,7003.9522259999994,5917.1320530000003,12075.779699999999,-1,8621.6510159999998,-1,-1,-1,-1,-1,-1,-1,7486.9834139999994,-1,-1,-1,-1,-1,-1,null,null,"Ropa DamaLogo corporativo (tamaño bolsillo)11"]
["Ropa Dama","Logo corporativo (tamaño espalda)",1,1,{"$f":"ROUND(AVERAGE(IF(F24:Z24>-1,F24:Z24)),0)","v":13499},14490.93564,12935.8941975,12317.295293999998,11955.021902999999,16906.09158,-1,13693.47849,-1,-1,-1,-1,-1,-1,-1,12196.537496999999,-1,-1,-1,-1,-1,-1,null,null,"Ropa DamaLogo corporativo (tamaño espalda)11"]
["Ropa Caballero","Vestido formal de dos piezas para hombre: saco y pantalón (Opción uno).",1,1,{"$f":"ROUND(AVERAGE(IF(F25:Z25>-1,F25:Z25)),0)","v":279904},-1,238617.40687199999,233304.06380399998,301773.73470299999,-1,-1,-1,-1,-1,-1,-1,-1,-1,389081.621934,236745.66101849999,-1,-1,-1,-1,-1,-1,null,null,"Ropa CaballeroVestido formal de dos piezas para hombre: saco y pantalón (Opción uno).11"]
["Ropa Caballero","Vestido formal de dos piezas para hombre: saco y pantalón (Opción dos).",1,1,{"$f":"ROUND(AVERAGE(IF(F26:Z26>-1,F26:Z26)),0)","v":256881},-1,226058.59598399999,221228.28410399996,264459.57542999997,-1,-1,-1,-1,-1,-1,-1,-1,-1,349956.09570599993,222701.30138249998,-1,-1,-1,-1,-1,-1,null,null,"Ropa CaballeroVestido formal de dos piezas para hombre: saco y pantalón (Opción dos).11"]
["Ropa Caballero","Camisa formal manga larga (Tipo uno, recomendable clima cálido).",1,1,{"$f":"ROUND(AVERAGE(IF(F27:Z27>-1,F27:Z27)),0)","v":67045},-1,62794.054439999993,61827.992063999998,62069.507657999995,-1,-1,-1,-1,-1,-1,-1,-1,-1,85858.793666999991,62673.296642999994,-1,-1,-1,-1,-1,-1,null,null,"Ropa CaballeroCamisa formal manga larga (Tipo uno, recomendable clima cálido).11"]
["Ropa Caballero","Camisa formal manga corta (Tipo uno, recomendable clima cálido).",1,1,{"$f":"ROUND(AVERAGE(IF(F28:Z28>-1,F28:Z28)),0)","v":61118},-1,56514.648995999996,55790.102213999999,56152.375604999994,-1,-1,-1,-1,-1,-1,-1,-1,-1,81511.512975000005,55621.496987999999,-1,-1,-1,-1,-1,-1,null,null,"Ropa CaballeroCamisa formal manga corta (Tipo uno, recomendable clima cálido).11"]
["Ropa Caballero","Camisa formal manga larga para caballero (Tipo dos).",1,1,{"$f":"ROUND(AVERAGE(IF(F29:Z29>-1,F29:Z29)),0)","v":69025},-1,62794.054439999993,61827.992063999998,62190.265454999993,-1,-1,-1,-1,-1,-1,-1,-1,-1,95640.175223999991,62673.296642999994,-1,-1,-1,-1,-1,-1,null,null,"Ropa CaballeroCamisa formal manga larga para caballero (Tipo dos).11"]
["Ropa Caballero","Camisa formal manga corta para caballero (Tipo dos).",1,1,{"$f":"ROUND(AVERAGE(IF(F30:Z30>-1,F30:Z30)),0)","v":62640},-1,56514.648995999996,55790.102213999999,56152.375604999994,-1,-1,-1,-1,-1,-1,-1,-1,-1,89119.254185999991,55621.496987999999,-1,-1,-1,-1,-1,-1,null,null,"Ropa CaballeroCamisa formal manga corta para caballero (Tipo dos).11"]
["Ropa Caballero","Corbata",1,1,{"$f":"ROUND(AVERAGE(IF(F31:Z31>-1,F31:Z31)),0)","v":24879},-1,18838.216331999996,18355.185143999999,22823.223632999998,-1,-1,-1,-1,-1,-1,-1,-1,-1,39125.526228000002,25250.911042499996,-1,-1,-1,-1,-1,-1,null,null,"Ropa CaballeroCorbata11"]
["Ropa Caballero","Chaqueta casual o sport.",1,1,{"$f":"ROUND(AVERAGE(IF(F32:Z32>-1,F32:Z32)),0)","v":114715},-1,96703.071682499984,95640.175223999991,107957.47051799999,-1,-1,-1,-1,-1,-1,-1,-1,-1,176064.86802599998,97210.026584999985,-1,-1,-1,-1,-1,-1,null,null,"Ropa CaballeroChaqueta casual o sport.11"]
["Ropa Caballero","Chaqueta de jean",1,1,{"$f":"ROUND(AVERAGE(IF(F33:Z33>-1,F33:Z33)),0)","v":118215},-1,109261.88257049999,111338.688834,107353.68153299998,-1,-1,-1,-1,-1,-1,-1,-1,-1,152154.82421999998,110963.88397349999,-1,-1,-1,-1,-1,-1,null,null,"Ropa CaballeroChaqueta de jean11"]
["Ropa Caballero","Chaqueta de drill",1,1,{"$f":"ROUND(AVERAGE(IF(F34:Z34>-1,F34:Z34)),0)","v":117360},-1,113029.29799199999,106508.37695399998,107353.68153299998,-1,-1,-1,-1,-1,-1,-1,-1,-1,152154.82421999998,107752.41010799998,-1,-1,-1,-1,-1,-1,null,null,"Ropa CaballeroChaqueta de drill11"]
["Ropa Caballero","Blazer para hombre.",1,1,{"$f":"ROUND(AVERAGE(IF(F35:Z35>-1,F35:Z35)),0)","v":183818},-1,169543.94698800001,166887.27545399999,216156.45663,-1,-1,-1,-1,-1,-1,-1,-1,-1,195627.63113999998,170872.28275499999,-1,-1,-1,-1,-1,-1,null,null,"Ropa CaballeroBlazer para hombre.11"]
["Ropa Caballero","Camisa sport o informal",1,1,{"$f":"ROUND(AVERAGE(IF(F36:Z36>-1,F36:Z36)),0)","v":63666},-1,62794.054439999993,61827.992063999998,61465.718672999988,-1,-1,-1,-1,-1,-1,-1,-1,-1,69556.49107199999,62685.828112499992,-1,-1,-1,-1,-1,-1,null,null,"Ropa CaballeroCamisa sport o informal11"]
["Ropa Caballero","Camiseta tipo t-shirt blanca",1,1,{"$f":"ROUND(AVERAGE(IF(F37:Z37>-1,F37:Z37)),0)","v":16897},-1,11303.385488999998,12317.295293999998,11471.990714999998,-1,-1,-1,-1,-1,-1,-1,-1,-1,36951.885881999995,12438.053091,-1,-1,-1,-1,-1,-1,null,null,"Ropa CaballeroCamiseta tipo t-shirt blanca11"]
["Ropa Caballero","Camiseta tipo t-shirt estampada",1,1,{"$f":"ROUND(AVERAGE(IF(F38:Z38>-1,F38:Z38)),0)","v":20867},-1,15070.8009105,14732.451233999998,20408.067692999997,-1,-1,-1,-1,-1,-1,-1,-1,-1,39125.526228000002,14997.890542499999,-1,-1,-1,-1,-1,-1,null,null,"Ropa CaballeroCamiseta tipo t-shirt estampada11"]
["Ropa Caballero","Camisa tipo polo",1,1,{"$f":"ROUND(AVERAGE(IF(F39:Z39>-1,F39:Z39)),0)","v":34150},-1,31397.027219999996,30430.964843999998,30793.238235000001,-1,-1,-1,-1,-1,-1,-1,-1,-1,47820.087611999996,30310.207047,-1,-1,-1,-1,-1,-1,null,null,"Ropa CaballeroCamisa tipo polo11"]
["Ropa Caballero","Pantalón de dril formal",1,1,{"$f":"ROUND(AVERAGE(IF(F40:Z40>-1,F40:Z40)),0)","v":72889},-1,69073.459883999996,67865.881913999998,66296.03055299999,-1,-1,-1,-1,-1,-1,-1,-1,-1,91292.894531999991,69918.764463,-1,-1,-1,-1,-1,-1,null,null,"Ropa CaballeroPantalón de dril formal11"]
["Ropa Caballero","Jean clásico",1,1,{"$f":"ROUND(AVERAGE(IF(F41:Z41>-1,F41:Z41)),0)","v":62130},-1,56514.648995999996,55790.102213999999,54220.25085299999,-1,-1,-1,-1,-1,-1,-1,-1,-1,89119.254185999991,55005.176533499995,-1,-1,-1,-1,-1,-1,null,null,"Ropa CaballeroJean clásico11"]
["Ropa Caballero","Jean informal",1,1,{"$f":"ROUND(AVERAGE(IF(F42:Z42>-1,F42:Z42)),0)","v":69979},-1,62794.054439999993,61827.992063999998,60258.14070299999,-1,-1,-1,-1,-1,-1,-1,-1,-1,102161.09626199999,62854.433338499992,-1,-1,-1,-1,-1,-1,null,null,"Ropa CaballeroJean informal11"]
["Ropa Caballero","Bata o blusa labor",1,1,{"$f":"ROUND(AVERAGE(IF(F43:Z43>-1,F43:Z43)),0)","v":30185},-1,11931.098188499998,31638.542813999997,31276.269422999998,-1,-1,-1,-1,-1,-1,-1,-1,-1,41299.166574000003,34778.245535999995,-1,-1,-1,-1,-1,-1,null,null,"Ropa CaballeroBata o blusa labor11"]
["Ropa Caballero","Calcetín para calzado calle",1,1,{"$f":"ROUND(AVERAGE(IF(F44:Z44>-1,F44:Z44)),0)","v":12400},-1,11303.385488999998,11109.717323999999,10868.201729999999,-1,-1,-1,-1,-1,-1,-1,-1,-1,17389.122767999997,11327.309203499999,-1,-1,-1,-1,-1,-1,null,null,"Ropa CaballeroCalcetín para calzado calle11"]
["Ropa Caballero","Calcetín para calzado deportivo",1,1,{"$f":"ROUND(AVERAGE(IF(F45:Z45>-1,F45:Z45)),0)","v":12622},-1,11931.098188499998,11109.717323999999,11351.232918,-1,-1,-1,-1,-1,-1,-1,-1,-1,17389.122767999997,11327.309203499999,-1,-1,-1,-1,-1,-1,null,null,"Ropa CaballeroCalcetín para calzado deportivo11"]
["Ropa Caballero","Pantaloncillo tipo bóxer.",1,1,{"$f":"ROUND(AVERAGE(IF(F46:Z46>-1,F46:Z46)),0)","v":19906},-1,31397.027219999996,12317.295293999998,15577.755812999998,-1,-1,-1,-1,-1,-1,-1,-1,-1,28257.324497999998,11978.9456175,-1,-1,-1,-1,-1,-1,null,null,"Ropa CaballeroPantaloncillo tipo bóxer.11"]
["Ropa Caballero","Gorra o cachucha",1,1,{"$f":"ROUND(AVERAGE(IF(F47:Z47>-1,F47:Z47)),0)","v":20152},-1,18838.216331999996,19562.763114000001,22823.223632999998,-1,-1,-1,-1,-1,-1,-1,-1,-1,19562.763114000001,19972.883933999998,-1,-1,-1,-1,-1,-1,null,null,"Ropa CaballeroGorra o cachucha11"]
["Ropa Caballero","Tula / Morral",1,1,{"$f":"ROUND(AVERAGE(IF(F48:Z48>-1,F48:Z48)),0)","v":76012},-1,71585.449906499998,70281.037853999995,70039.522259999998,-1,-1,-1,-1,-1,-1,-1,-1,-1,95640.175223999991,72515.057098499994,-1,-1,-1,-1,-1,-1,null,null,"Ropa CaballeroTula / Morral11"]
["Ropa Caballero","Logo corporativo (tamaño bolsillo)",1,1,{"$f":"ROUND(AVERAGE(IF(F49:Z49>-1,F49:Z49)),0)","v":7019},-1,6279.4054439999991,7003.9522259999994,5917.1320530000003,-1,-1,-1,-1,-1,-1,-1,-1,-1,8694.5613839999987,7197.6203909999995,-1,-1,-1,-1,-1,-1,null,null,"Ropa CaballeroLogo corporativo (tamaño bolsillo)11"]
["Ropa Caballero","Logo corporativo (tamaño espalda)",1,1,{"$f":"ROUND(AVERAGE(IF(F50:Z50>-1,F50:Z50)),0)","v":12834},-1,12558.810887999998,12317.295293999998,11955.021902999999,-1,-1,-1,-1,-1,-1,-1,-1,-1,15215.482421999999,12123.627128999999,-1,-1,-1,-1,-1,-1,null,null,"Ropa CaballeroLogo corporativo (tamaño espalda)11"]
["Calzado Dama","Calzado de calle para dama.",1,1,{"$f":"ROUND(AVERAGE(IF(F51:Z51>-1,F51:Z51)),0)","v":109846},-1,-1,88394.707403999986,96485.479802999995,114719.90714999998,-1,-1,-1,-1,-1,-1,-1,-1,106266.86135999998,-1,-1,144788.59860299999,-1,92681.609197499987,125588.10887999999,-1,null,null,"Calzado DamaCalzado de calle para dama.11"]
["Calzado Dama","Calzado casual para dama.",1,1,{"$f":"ROUND(AVERAGE(IF(F52:Z52>-1,F52:Z52)),0)","v":107164},-1,-1,89119.254185999991,89964.558764999994,114719.90714999998,-1,-1,-1,-1,-1,-1,-1,-1,106266.86135999998,-1,-1,144788.59860299999,-1,90568.347750000001,114719.90714999998,-1,null,null,"Calzado DamaCalzado casual para dama.11"]
["Calzado Dama","Calzado de calle para dama clima cálido.",1,1,{"$f":"ROUND(AVERAGE(IF(F53:Z53>-1,F53:Z53)),0)","v":109106},-1,-1,89964.558764999994,96485.479802999995,114719.90714999998,-1,-1,-1,-1,-1,-1,-1,-1,106266.86135999998,-1,-1,144788.59860299999,-1,93177.171854999993,118342.64105999999,-1,null,null,"Calzado DamaCalzado de calle para dama clima cálido.11"]
["Calzado Dama","Cinturón.",1,1,{"$f":"ROUND(AVERAGE(IF(F54:Z54>-1,F54:Z54)),0)","v":40016},-1,-1,30672.480437999995,33691.425362999995,42265.228949999997,-1,-1,-1,-1,-1,-1,-1,-1,36227.339099999997,-1,-1,42144.471152999991,-1,32315.242166999997,62794.054439999993,-1,null,null,"Calzado DamaCinturón.11"]
["Calzado Caballero","Calzado de calle para caballero formal.",1,1,{"$f":"ROUND(AVERAGE(IF(F55:Z55>-1,F55:Z55)),0)","v":116048},-1,-1,98055.331163999988,99021.39353999999,-1,-1,-1,-1,-1,-1,-1,-1,-1,111097.17324,-1,-1,156864.37830299998,120154.008015,102764.885247,124380.53090999999,-1,null,null,"Calzado CaballeroCalzado de calle para caballero formal.11"]
["Calzado Caballero","Calzado deportivo para caballero",1,1,{"$f":"ROUND(AVERAGE(IF(F56:Z56>-1,F56:Z56)),0)","v":117032},-1,-1,106508.37695399998,105663.07237499999,-1,-1,-1,-1,-1,-1,-1,-1,-1,111097.17324,-1,-1,156864.37830299998,111700.96222499998,111459.44663099998,115927.48512,-1,null,null,"Calzado CaballeroCalzado deportivo para caballero11"]
["Calzado Caballero","Calzado casual para caballero.",1,1,{"$f":"ROUND(AVERAGE(IF(F57:Z57>-1,F57:Z57)),0)","v":116411},-1,-1,106508.37695399998,96485.479802999995,-1,-1,-1,-1,-1,-1,-1,-1,-1,111097.17324,-1,-1,156864.37830299998,114116.11816499999,111459.44663099998,118342.64105999999,-1,null,null,"Calzado CaballeroCalzado casual para caballero.11"]
["Calzado Caballero","Cinturón",1,1,{"$f":"ROUND(AVERAGE(IF(F58:Z58>-1,F58:Z58)),0)","v":41832},-1,-1,29223.386874,33691.425362999995,-1,-1,-1,-1,-1,-1,-1,-1,-1,36227.339099999997,-1,-1,42144.471152999991,57963.742559999999,30780.706765499996,62794.054439999993,-1,null,null,"Calzado CaballeroCinturón11"]
["Ropa Dama","Sastre formal de dos piezas para dama: chaqueta y falda o pantalón (Opción Uno).",1,2,{"$f":"ROUND(AVERAGE(IF(F59:Z59>-1,F59:Z59)),0)","v":227690},241757.10959399998,213499.78509600001,209514.77779499997,228232.23632999999,227024.65836,-1,258892.18529849997,-1,-1,-1,-1,-1,-1,-1,214912.423476,-1,-1,-1,-1,-1,-1,null,null,"Ropa DamaSastre formal de dos piezas para dama: chaqueta y falda o pantalón (Opción Uno).12"]
["Ropa Dama","Sastre formal de dos piezas para dama: chaqueta y falda o pantalón (Opción Dos).",1,2,{"$f":"ROUND(AVERAGE(IF(F60:Z60>-1,F60:Z60)),0)","v":206168},179192.03927849996,210987.79507349999,207099.621855,202873.09895999997,202873.09895999997,-1,225817.08038999999,-1,-1,-1,-1,-1,-1,-1,214332.55820549998,-1,-1,-1,-1,-1,-1,null,null,"Ropa DamaSastre formal de dos piezas para dama: chaqueta y falda o pantalón (Opción Dos).12"]
["Ropa Dama","Sastre formal de tres piezas para dama: chaqueta, chaleco y falda o pantalón.",1,2,{"$f":"ROUND(AVERAGE(IF(F61:Z61>-1,F61:Z61)),0)","v":294235},363964.00015799998,270014.43409199995,265063.36441499996,295856.60265000002,265667.15339999995,-1,332083.94175,-1,-1,-1,-1,-1,-1,-1,266995.48916699993,-1,-1,-1,-1,-1,-1,null,null,"Ropa DamaSastre formal de tres piezas para dama: chaqueta, chaleco y falda o pantalón.12"]
["Ropa Dama","Blazer para dama.",1,2,{"$f":"ROUND(AVERAGE(IF(F62:Z62>-1,F62:Z62)),0)","v":181525},164314.906533,194661.568764,191401.10824499998,199250.36504999999,147324.51233999999,-1,179325.32854499997,-1,-1,-1,-1,-1,-1,-1,194396.12945549999,-1,-1,-1,-1,-1,-1,null,null,"Ropa DamaBlazer para dama.12"]
["Ropa Dama","Blusa formal manga larga para dama.",1,2,{"$f":"ROUND(AVERAGE(IF(F63:Z63>-1,F63:Z63)),0)","v":70582},63494.677507499997,71023.812227999995,69435.733274999991,69435.733274999991,57963.742559999999,-1,91655.167923000001,-1,-1,-1,-1,-1,-1,-1,71065.963534499984,-1,-1,-1,-1,-1,-1,null,null,"Ropa DamaBlusa formal manga larga para dama.12"]
["Ropa Dama","Blusa formal manga corta para dama.",1,2,{"$f":"ROUND(AVERAGE(IF(F64:Z64>-1,F64:Z64)),0)","v":67014},62166.341740499993,68509.543756500003,67020.577334999994,67020.577334999994,55548.586620000002,-1,82356.817554000008,-1,-1,-1,-1,-1,-1,-1,66477.167248500002,-1,-1,-1,-1,-1,-1,null,null,"Ropa DamaBlusa formal manga corta para dama.12"]
["Ropa Dama","Blusa sport o informal para dama.",1,2,{"$f":"ROUND(AVERAGE(IF(F65:Z65>-1,F65:Z65)),0)","v":68894},74386.802951999998,67639.176238499989,67020.577334999994,65812.999364999996,57963.742559999999,-1,82356.817554000008,-1,-1,-1,-1,-1,-1,-1,67080.956233499994,-1,-1,-1,-1,-1,-1,null,null,"Ropa DamaBlusa sport o informal para dama.12"]
["Ropa Dama","Blusa para dama.",1,2,{"$f":"ROUND(AVERAGE(IF(F66:Z66>-1,F66:Z66)),0)","v":66877},55790.102213999999,72840.875305499983,71850.889215000003,70884.826839000001,57963.742559999999,-1,73058.467184999987,-1,-1,-1,-1,-1,-1,-1,65752.620466499997,-1,-1,-1,-1,-1,-1,null,null,{"$f":"A66&B66&C66&D66","v":"Ropa DamaBlusa para dama.12"}]
["Ropa Dama","Chaqueta casual o sport.",1,2,{"$f":"ROUND(AVERAGE(IF(F67:Z67>-1,F67:Z67)),0)","v":124123},110118.57939449999,114284.72339099999,111700.96222499998,119550.21902999999,135248.73264,-1,162056.96357399996,-1,-1,-1,-1,-1,-1,-1,115903.56140549999,-1,-1,-1,-1,-1,-1,null,null,"Ropa DamaChaqueta casual o sport.12"]
["Ropa Dama","Chaqueta de jean",1,2,{"$f":"ROUND(AVERAGE(IF(F68:Z68>-1,F68:Z68)),0)","v":125671},159400.29203999997,113029.29799199999,138267.67756499999,107474.43932999999,123172.95294,-1,100953.51829199999,-1,-1,-1,-1,-1,-1,-1,137398.44927149999,-1,-1,-1,-1,-1,-1,null,null,"Ropa DamaChaqueta de jean12"]
["Ropa Dama","Falda",1,2,{"$f":"ROUND(AVERAGE(IF(F69:Z69>-1,F69:Z69)),0)","v":73188},85013.489088000002,69073.459883999996,68228.155304999993,67020.577334999994,60378.898499999996,-1,92983.503689999998,-1,-1,-1,-1,-1,-1,-1,69616.869970499989,-1,-1,-1,-1,-1,-1,null,null,"Ropa DamaFalda12"]
["Ropa Dama","Gabán o abrigo para dama",1,2,{"$f":"ROUND(AVERAGE(IF(F70:Z70>-1,F70:Z70)),0)","v":202459},236443.76652599999,214755.21049499998,210722.35576499999,206495.83286999998,193212.47519999999,-1,146116.93436999997,-1,-1,-1,-1,-1,-1,-1,209466.93036599999,-1,-1,-1,-1,-1,-1,null,null,"Ropa DamaGabán o abrigo para dama12"]
["Ropa Dama","Pantalón formal",1,2,{"$f":"ROUND(AVERAGE(IF(F71:Z71>-1,F71:Z71)),0)","v":85458},86341.824854999999,83417.435563499996,81511.512975000005,81994.544162999999,74869.834139999992,-1,104938.52559299998,-1,-1,-1,-1,-1,-1,-1,85134.246884999986,-1,-1,-1,-1,-1,-1,null,null,"Ropa DamaPantalón formal12"]
["Ropa Dama","Pantalón drill formal",1,2,{"$f":"ROUND(AVERAGE(IF(F72:Z72>-1,F72:Z72)),0)","v":80614},85013.489088000002,75352.865327999985,74266.045155,72333.920402999996,96606.237599999993,-1,86341.824854999999,-1,-1,-1,-1,-1,-1,-1,74386.802951999998,-1,-1,-1,-1,-1,-1,null,null,"Ropa DamaPantalón drill formal12"]
["Ropa Dama","Jean clásico",1,2,{"$f":"ROUND(AVERAGE(IF(F73:Z73>-1,F73:Z73)),0)","v":72538},86341.824854999999,60282.064417499991,59775.109514999996,58157.410724999994,96606.237599999993,-1,86341.824854999999,-1,-1,-1,-1,-1,-1,-1,60258.14070299999,-1,-1,-1,-1,-1,-1,null,null,"Ropa DamaJean clásico12"]
["Ropa Dama","Jean informal",1,2,{"$f":"ROUND(AVERAGE(IF(F74:Z74>-1,F74:Z74)),0)","v":90175},126191.89786499999,72840.875305499983,71850.889215000003,69918.764463,106266.86135999998,-1,112908.54019499999,-1,-1,-1,-1,-1,-1,-1,71247.100229999996,-1,-1,-1,-1,-1,-1,null,null,"Ropa DamaJean informal12"]
["Ropa Dama","Camisa tipo polo",1,2,{"$f":"ROUND(AVERAGE(IF(F75:Z75>-1,F75:Z75)),0)","v":36900},38521.737242999996,31397.027219999996,30793.238235000001,30793.238235000001,43472.806919999995,-1,51805.094912999994,-1,-1,-1,-1,-1,-1,-1,31517.785016999998,-1,-1,-1,-1,-1,-1,null,null,"Ropa DamaCamisa tipo polo12"]
["Ropa Dama","Camiseta tipo T-shirt básica",1,2,{"$f":"ROUND(AVERAGE(IF(F76:Z76>-1,F76:Z76)),0)","v":20815},17932.532854500001,16326.226309499998,16302.302594999997,15577.755812999998,28981.871279999999,-1,34403.440675499995,-1,-1,-1,-1,-1,-1,-1,16181.544797999999,-1,-1,-1,-1,-1,-1,null,null,"Ropa DamaCamiseta tipo T-shirt básica12"]
["Ropa Dama","Bata o blusa labor",1,2,{"$f":"ROUND(AVERAGE(IF(F77:Z77>-1,F77:Z77)),0)","v":42298},46491.751844999999,31397.027219999996,32000.816204999996,30068.691452999996,43472.806919999995,-1,78238.520986499992,-1,-1,-1,-1,-1,-1,-1,34415.972145,-1,-1,-1,-1,-1,-1,null,null,"Ropa DamaBata o blusa labor12"]
["Ropa Dama","Pashmina",1,2,{"$f":"ROUND(AVERAGE(IF(F78:Z78>-1,F78:Z78)),0)","v":29482},11955.021902999999,25117.621775999996,25962.926354999996,24151.559399999998,28981.871279999999,-1,61103.445281999993,-1,-1,-1,-1,-1,-1,-1,29102.629076999998,-1,-1,-1,-1,-1,-1,null,null,"Ropa DamaPashmina12"]
["Ropa Dama","Vestido",1,2,{"$f":"ROUND(AVERAGE(IF(F79:Z79>-1,F79:Z79)),0)","v":152483},96968.510990999988,163264.54154399998,160004.08102499999,158796.50305499998,156985.1361,-1,172683.64971,-1,-1,-1,-1,-1,-1,-1,158675.74525800001,-1,-1,-1,-1,-1,-1,null,null,"Ropa DamaVestido12"]
["Ropa Dama","Logo corporativo (tamaño bolsillo)",1,2,{"$f":"ROUND(AVERAGE(IF(F80:Z80>-1,F80:Z80)),0)","v":7518},4830.3118799999993,6279.4054439999991,7003.9522259999994,5917.1320530000003,12075.779699999999,-1,9032.9110604999987,-1,-1,-1,-1,-1,-1,-1,7486.9834139999994,-1,-1,-1,-1,-1,-1,null,null,"Ropa DamaLogo corporativo (tamaño bolsillo)12"]
["Ropa Dama","Logo corporativo (tamaño espalda)",1,2,{"$f":"ROUND(AVERAGE(IF(F81:Z81>-1,F81:Z81)),0)","v":13593},14490.93564,12935.8941975,12317.295293999998,11955.021902999999,16906.09158,-1,14346.254128499999,-1,-1,-1,-1,-1,-1,-1,12196.537496999999,-1,-1,-1,-1,-1,-1,null,null,"Ropa DamaLogo corporativo (tamaño espalda)12"]
["Ropa Caballero","Vestido formal de dos piezas para hombre: saco y pantalón (Opción uno).",1,2,{"$f":"ROUND(AVERAGE(IF(F82:Z82>-1,F82:Z82)),0)","v":279904},-1,238617.40687199999,233304.06380399998,301773.73470299999,-1,-1,-1,-1,-1,-1,-1,-1,-1,389081.621934,236745.66101849999,-1,-1,-1,-1,-1,-1,null,null,"Ropa CaballeroVestido formal de dos piezas para hombre: saco y pantalón (Opción uno).12"]
["Ropa Caballero","Vestido formal de dos piezas para hombre: saco y pantalón (Opción dos).",1,2,{"$f":"ROUND(AVERAGE(IF(F83:Z83>-1,F83:Z83)),0)","v":256881},-1,226058.59598399999,221228.28410399996,264459.57542999997,-1,-1,-1,-1,-1,-1,-1,-1,-1,349956.09570599993,222701.30138249998,-1,-1,-1,-1,-1,-1,null,null,"Ropa CaballeroVestido formal de dos piezas para hombre: saco y pantalón (Opción dos).12"]
["Ropa Caballero","Camisa formal manga larga (Tipo uno, recomendable clima cálido).",1,2,{"$f":"ROUND(AVERAGE(IF(F84:Z84>-1,F84:Z84)),0)","v":67045},-1,62794.054439999993,61827.992063999998,62069.507657999995,-1,-1,-1,-1,-1,-1,-1,-1,-1,85858.793666999991,62673.296642999994,-1,-1,-1,-1,-1,-1,null,null,"Ropa CaballeroCamisa formal manga larga (Tipo uno, recomendable clima cálido).12"]
["Ropa Caballero","Camisa formal manga corta (Tipo uno, recomendable clima cálido).",1,2,{"$f":"ROUND(AVERAGE(IF(F85:Z85>-1,F85:Z85)),0)","v":61118},-1,56514.648995999996,55790.102213999999,56152.375604999994,-1,-1,-1,-1,-1,-1,-1,-1,-1,81511.512975000005,55621.496987999999,-1,-1,-1,-1,-1,-1,null,null,"Ropa CaballeroCamisa formal manga corta (Tipo uno, recomendable clima cálido).12"]
["Ropa Caballero","Camisa formal manga larga para caballero (Tipo dos).",1,2,{"$f":"ROUND(AVERAGE(IF(F86:Z86>-1,F86:Z86)),0)","v":69025},-1,62794.054439999993,61827.992063999998,62190.265454999993,-1,-1,-1,-1,-1,-1,-1,-1,-1,95640.175223999991,62673.296642999994,-1,-1,-1,-1,-1,-1,null,null,"Ropa CaballeroCamisa formal manga larga para caballero (Tipo dos).12"]
["Ropa Caballero","Camisa formal manga corta para caballero (Tipo dos).",1,2,{"$f":"ROUND(AVERAGE(IF(F87:Z87>-1,F87:Z87)),0)","v":62640},-1,56514.648995999996,55790.102213999999,56152.375604999994,-1,-1,-1,-1,-1,-1,-1,-1,-1,89119.254185999991,55621.496987999999,-1,-1,-1,-1,-1,-1,null,null,"Ropa CaballeroCamisa formal manga corta para caballero (Tipo dos).12"]
["Ropa Caballero","Corbata",1,2,{"$f":"ROUND(AVERAGE(IF(F88:Z88>-1,F88:Z88)),0)","v":24879},-1,18838.216331999996,18355.185143999999,22823.223632999998,-1,-1,-1,-1,-1,-1,-1,-1,-1,39125.526228000002,25250.911042499996,-1,-1,-1,-1,-1,-1,null,null,"Ropa CaballeroCorbata12"]
["Ropa Caballero","Chaqueta casual o sport.",1,2,{"$f":"ROUND(AVERAGE(IF(F89:Z89>-1,F89:Z89)),0)","v":114715},-1,96703.071682499984,95640.175223999991,107957.47051799999,-1,-1,-1,-1,-1,-1,-1,-1,-1,176064.86802599998,97210.026584999985,-1,-1,-1,-1,-1,-1,null,null,"Ropa CaballeroChaqueta casual o sport.12"]
["Ropa Caballero","Chaqueta de jean",1,2,{"$f":"ROUND(AVERAGE(IF(F90:Z90>-1,F90:Z90)),0)","v":118215},-1,109261.88257049999,111338.688834,107353.68153299998,-1,-1,-1,-1,-1,-1,-1,-1,-1,152154.82421999998,110963.88397349999,-1,-1,-1,-1,-1,-1,null,null,"Ropa CaballeroChaqueta de jean12"]
["Ropa Caballero","Chaqueta de drill",1,2,{"$f":"ROUND(AVERAGE(IF(F91:Z91>-1,F91:Z91)),0)","v":117360},-1,113029.29799199999,106508.37695399998,107353.68153299998,-1,-1,-1,-1,-1,-1,-1,-1,-1,152154.82421999998,107752.41010799998,-1,-1,-1,-1,-1,-1,null,null,"Ropa CaballeroChaqueta de drill12"]
["Ropa Caballero","Blazer para hombre.",1,2,{"$f":"ROUND(AVERAGE(IF(F92:Z92>-1,F92:Z92)),0)","v":183818},-1,169543.94698800001,166887.27545399999,216156.45663,-1,-1,-1,-1,-1,-1,-1,-1,-1,195627.63113999998,170872.28275499999,-1,-1,-1,-1,-1,-1,null,null,"Ropa CaballeroBlazer para hombre.12"]
["Ropa Caballero","Camisa sport o informal",1,2,{"$f":"ROUND(AVERAGE(IF(F93:Z93>-1,F93:Z93)),0)","v":63666},-1,62794.054439999993,61827.992063999998,61465.718672999988,-1,-1,-1,-1,-1,-1,-1,-1,-1,69556.49107199999,62685.828112499992,-1,-1,-1,-1,-1,-1,null,null,"Ropa CaballeroCamisa sport o informal12"]
["Ropa Caballero","Camiseta tipo t-shirt blanca",1,2,{"$f":"ROUND(AVERAGE(IF(F94:Z94>-1,F94:Z94)),0)","v":16897},-1,11303.385488999998,12317.295293999998,11471.990714999998,-1,-1,-1,-1,-1,-1,-1,-1,-1,36951.885881999995,12438.053091,-1,-1,-1,-1,-1,-1,null,null,"Ropa CaballeroCamiseta tipo t-shirt blanca12"]
["Ropa Caballero","Camiseta tipo t-shirt estampada",1,2,{"$f":"ROUND(AVERAGE(IF(F95:Z95>-1,F95:Z95)),0)","v":20867},-1,15070.8009105,14732.451233999998,20408.067692999997,-1,-1,-1,-1,-1,-1,-1,-1,-1,39125.526228000002,14997.890542499999,-1,-1,-1,-1,-1,-1,null,null,"Ropa CaballeroCamiseta tipo t-shirt estampada12"]
["Ropa Caballero","Camisa tipo polo",1,2,{"$f":"ROUND(AVERAGE(IF(F96:Z96>-1,F96:Z96)),0)","v":34150},-1,31397.027219999996,30430.964843999998,30793.238235000001,-1,-1,-1,-1,-1,-1,-1,-1,-1,47820.087611999996,30310.207047,-1,-1,-1,-1,-1,-1,null,null,"Ropa CaballeroCamisa tipo polo12"]
["Ropa Caballero","Pantalón de dril formal",1,2,{"$f":"ROUND(AVERAGE(IF(F97:Z97>-1,F97:Z97)),0)","v":72889},-1,69073.459883999996,67865.881913999998,66296.03055299999,-1,-1,-1,-1,-1,-1,-1,-1,-1,91292.894531999991,69918.764463,-1,-1,-1,-1,-1,-1,null,null,"Ropa CaballeroPantalón de dril formal12"]
["Ropa Caballero","Jean clásico",1,2,{"$f":"ROUND(AVERAGE(IF(F98:Z98>-1,F98:Z98)),0)","v":62130},-1,56514.648995999996,55790.102213999999,54220.25085299999,-1,-1,-1,-1,-1,-1,-1,-1,-1,89119.254185999991,55005.176533499995,-1,-1,-1,-1,-1,-1,null,null,"Ropa CaballeroJean clásico12"]
["Ropa Caballero","Jean informal",1,2,{"$f":"ROUND(AVERAGE(IF(F99:Z99>-1,F99:Z99)),0)","v":69979},-1,62794.054439999993,61827.992063999998,60258.14070299999,-1,-1,-1,-1,-1,-1,-1,-1,-1,102161.09626199999,62854.433338499992,-1,-1,-1,-1,-1,-1,null,null,"Ropa CaballeroJean informal12"]
["Ropa Caballero","Bata o blusa labor",1,2,{"$f":"ROUND(AVERAGE(IF(F100:Z100>-1,F100:Z100)),0)","v":30185},-1,11931.098188499998,31638.542813999997,31276.269422999998,-1,-1,-1,-1,-1,-1,-1,-1,-1,41299.166574000003,34778.245535999995,-1,-1,-1,-1,-1,-1,null,null,"Ropa CaballeroBata o blusa labor12"]
["Ropa Caballero","Calcetín para calzado calle",1,2,{"$f":"ROUND(AVERAGE(IF(F101:Z101>-1,F101:Z101)),0)","v":12400},-1,11303.385488999998,11109.717323999999,10868.201729999999,-1,-1,-1,-1,-1,-1,-1,-1,-1,17389.122767999997,11327.309203499999,-1,-1,-1,-1,-1,-1,null,null,"Ropa CaballeroCalcetín para calzado calle12"]
["Ropa Caballero","Calcetín para calzado deportivo",1,2,{"$f":"ROUND(AVERAGE(IF(F102:Z102>-1,F102:Z102)),0)","v":12622},-1,11931.098188499998,11109.717323999999,11351.232918,-1,-1,-1,-1,-1,-1,-1,-1,-1,17389.122767999997,11327.309203499999,-1,-1,-1,-1,-1,-1,null,null,"Ropa CaballeroCalcetín para calzado deportivo12"]
["Ropa Caballero","Pantaloncillo tipo bóxer.",1,2,{"$f":"ROUND(AVERAGE(IF(F103:Z103>-1,F103:Z103)),0)","v":19906},-1,31397.027219999996,12317.295293999998,15577.755812999998,-1,-1,-1,-1,-1,-1,-1,-1,-1,28257.324497999998,11978.9456175,-1,-1,-1,-1,-1,-1,null,null,"Ropa CaballeroPantaloncillo tipo bóxer.12"]
["Ropa Caballero","Gorra o cachucha",1,2,{"$f":"ROUND(AVERAGE(IF(F104:Z104>-1,F104:Z104)),0)","v":20152},-1,18838.216331999996,19562.763114000001,22823.223632999998,-1,-1,-1,-1,-1,-1,-1,-1,-1,19562.763114000001,19972.883933999998,-1,-1,-1,-1,-1,-1,null,null,"Ropa CaballeroGorra o cachucha12"]
["Ropa Caballero","Tula / Morral",1,2,{"$f":"ROUND(AVERAGE(IF(F105:Z105>-1,F105:Z105)),0)","v":76012},-1,71585.449906499998,70281.037853999995,70039.522259999998,-1,-1,-1,-1,-1,-1,-1,-1,-1,95640.175223999991,72515.057098499994,-1,-1,-1,-1,-1,-1,null,null,"Ropa CaballeroTula / Morral12"]
["Ropa Caballero","Logo corporativo (tamaño bolsillo)",1,2,{"$f":"ROUND(AVERAGE(IF(F106:Z106>-1,F106:Z106)),0)","v":7019},-1,6279.4054439999991,7003.9522259999994,5917.1320530000003,-1,-1,-1,-1,-1,-1,-1,-1,-1,8694.5613839999987,7197.6203909999995,-1,-1,-1,-1,-1,-1,null,null,"Ropa CaballeroLogo corporativo (tamaño bolsillo)12"]
["Ropa Caballero","Logo corporativo (tamaño espalda)",1,2,{"$f":"ROUND(AVERAGE(IF(F107:Z107>-1,F107:Z107)),0)","v":12834},-1,12558.810887999998,12317.295293999998,11955.021902999999,-1,-1,-1,-1,-1,-1,-1,-1,-1,15215.482421999999,12123.627128999999,-1,-1,-1,-1,-1,-1,null,null,"Ropa CaballeroLogo corporativo (tamaño espalda)12"]
["Calzado Dama","Calzado de calle para dama.",1,2,{"$f":"ROUND(AVERAGE(IF(F108:Z108>-1,F108:Z108)),0)","v":109846},-1,-1,88394.707403999986,96485.479802999995,114719.90714999998,-1,-1,-1,-1,-1,-1,-1,-1,106266.86135999998,-1,-1,144788.59860299999,-1,92681.609197499987,125588.10887999999,-1,null,null,"Calzado DamaCalzado de calle para dama.12"]
["Calzado Dama","Calzado casual para dama.",1,2,{"$f":"ROUND(AVERAGE(IF(F109:Z109>-1,F109:Z109)),0)","v":107164},-1,-1,89119.254185999991,89964.558764999994,114719.90714999998,-1,-1,-1,-1,-1,-1,-1,-1,106266.86135999998,-1,-1,144788.59860299999,-1,90568.347750000001,114719.90714999998,-1,null,null,"Calzado DamaCalzado casual para dama.12"]
["Calzado Dama","Calzado de calle para dama clima cálido.",1,2,{"$f":"ROUND(AVERAGE(IF(F110:Z110>-1,F110:Z110)),0)","v":109106},-1,-1,89964.558764999994,96485.479802999995,114719.90714999998,-1,-1,-1,-1,-1,-1,-1,-1,106266.86135999998,-1,-1,144788.59860299999,-1,93177.171854999993,118342.64105999999,-1,null,null,"Calzado DamaCalzado de calle para dama clima cálido.12"]
["Calzado Dama","Cinturón.",1,2,{"$f":"ROUND(AVERAGE(IF(F111:Z111>-1,F111:Z111)),0)","v":40016},-1,-1,30672.480437999995,33691.425362999995,42265.228949999997,-1,-1,-1,-1,-1,-1,-1,-1,36227.339099999997,-1,-1,42144.471152999991,-1,32315.242166999997,62794.054439999993,-1,null,null,"Calzado DamaCinturón.12"]
["Calzado Caballero","Calzado de calle para caballero formal.",1,2,{"$f":"ROUND(AVERAGE(IF(F112:Z112>-1,F112:Z112)),0)","v":116048},-1,-1,98055.331163999988,99021.39353999999,-1,-1,-1,-1,-1,-1,-1,-1,-1,111097.17324,-1,-1,156864.37830299998,120154.008015,102764.885247,124380.53090999999,-1,null,null,"Calzado CaballeroCalzado de calle para caballero formal.12"]
["Calzado Caballero","Calzado deportivo para caballero",1,2,{"$f":"ROUND(AVERAGE(IF(F113:Z113>-1,F113:Z113)),0)","v":117032},-1,-1,106508.37695399998,105663.07237499999,-1,-1,-1,-1,-1,-1,-1,-1,-1,111097.17324,-1,-1,156864.37830299998,111700.96222499998,111459.44663099998,115927.48512,-1,null,null,"Calzado CaballeroCalzado deportivo para caballero12"]
["Calzado Caballero","Calzado casual para caballero.",1,2,{"$f":"ROUND(AVERAGE(IF(F114:Z114>-1,F114:Z114)),0)","v":116411},-1,-1,106508.37695399998,96485.479802999995,-1,-1,-1,-1,-1,-1,-1,-1,-1,111097.17324,-1,-1,156864.37830299998,114116.11816499999,111459.44663099998,118342.64105999999,-1,null,null,"Calzado CaballeroCalzado casual para caballero.12"]
["Calzado Caballero","Cinturón",1,2,{"$f":"ROUND(AVERAGE(IF(F115:Z115>-1,F115:Z115)),0)","v":41832},-1,-1,29223.386874,33691.425362999995,-1,-1,-1,-1,-1,-1,-1,-1,-1,36227.339099999997,-1,-1,42144.471152999991,57963.742559999999,30780.706765499996,62794.054439999993,-1,null,null,"Calzado CaballeroCinturón12"]
["Ropa Dama","Sastre formal de dos piezas para dama: chaqueta y falda o pantalón (Opción Uno).",1,3,{"$f":"ROUND(AVERAGE(IF(F116:Z116>-1,F116:Z116)),0)","v":227018},241757.10959399998,213499.78509600001,209514.77779499997,228232.23632999999,227024.65836,-1,254186.048889,-1,-1,-1,-1,-1,-1,-1,214912.423476,-1,-1,-1,-1,-1,-1,null,null,"Ropa DamaSastre formal de dos piezas para dama: chaqueta y falda o pantalón (Opción Uno).13"]
["Ropa Dama","Sastre formal de dos piezas para dama: chaqueta y falda o pantalón (Opción Dos).",1,3,{"$f":"ROUND(AVERAGE(IF(F117:Z117>-1,F117:Z117)),0)","v":205581},179192.03927849996,210987.79507349999,207099.621855,202873.09895999997,202873.09895999997,-1,221711.31529199998,-1,-1,-1,-1,-1,-1,-1,214332.55820549998,-1,-1,-1,-1,-1,-1,null,null,"Ropa DamaSastre formal de dos piezas para dama: chaqueta y falda o pantalón (Opción Dos).13"]
["Ropa Dama","Sastre formal de tres piezas para dama: chaqueta, chaleco y falda o pantalón.",1,3,{"$f":"ROUND(AVERAGE(IF(F118:Z118>-1,F118:Z118)),0)","v":293372},363964.00015799998,270014.43409199995,265063.36441499996,295856.60265000002,265667.15339999995,-1,326046.05190000002,-1,-1,-1,-1,-1,-1,-1,266995.48916699993,-1,-1,-1,-1,-1,-1,null,null,"Ropa DamaSastre formal de tres piezas para dama: chaqueta, chaleco y falda o pantalón.13"]
["Ropa Dama","Blazer para dama.",1,3,{"$f":"ROUND(AVERAGE(IF(F119:Z119>-1,F119:Z119)),0)","v":181059},164314.906533,194661.568764,191401.10824499998,199250.36504999999,147324.51233999999,-1,176064.86802599998,-1,-1,-1,-1,-1,-1,-1,194396.12945549999,-1,-1,-1,-1,-1,-1,null,null,"Ropa DamaBlazer para dama.13"]
["Ropa Dama","Blusa formal manga larga para dama.",1,3,{"$f":"ROUND(AVERAGE(IF(F120:Z120>-1,F120:Z120)),0)","v":70344},63494.677507499997,71023.812227999995,69435.733274999991,69435.733274999991,57963.742559999999,-1,89988.482479500002,-1,-1,-1,-1,-1,-1,-1,71065.963534499984,-1,-1,-1,-1,-1,-1,null,null,"Ropa DamaBlusa formal manga larga para dama.13"]
["Ropa Dama","Blusa formal manga corta para dama.",1,3,{"$f":"ROUND(AVERAGE(IF(F121:Z121>-1,F121:Z121)),0)","v":66800},62166.341740499993,68509.543756500003,67020.577334999994,67020.577334999994,55548.586620000002,-1,80859.876560999997,-1,-1,-1,-1,-1,-1,-1,66477.167248500002,-1,-1,-1,-1,-1,-1,null,null,"Ropa DamaBlusa formal manga corta para dama.13"]
["Ropa Dama","Blusa sport o informal para dama.",1,3,{"$f":"ROUND(AVERAGE(IF(F122:Z122>-1,F122:Z122)),0)","v":68681},74386.802951999998,67639.176238499989,67020.577334999994,65812.999364999996,57963.742559999999,-1,80859.876560999997,-1,-1,-1,-1,-1,-1,-1,67080.956233499994,-1,-1,-1,-1,-1,-1,null,null,"Ropa DamaBlusa sport o informal para dama.13"]
["Ropa Dama","Blusa para dama.",1,3,{"$f":"ROUND(AVERAGE(IF(F123:Z123>-1,F123:Z123)),0)","v":66688},55790.102213999999,72840.875305499983,71850.889215000003,70884.826839000001,57963.742559999999,-1,71730.131418000004,-1,-1,-1,-1,-1,-1,-1,65752.620466499997,-1,-1,-1,-1,-1,-1,null,null,"Ropa DamaBlusa para dama.13"]
["Ropa Dama","Chaqueta casual o sport.",1,3,{"$f":"ROUND(AVERAGE(IF(F124:Z124>-1,F124:Z124)),0)","v":123703},110118.57939449999,114284.72339099999,111700.96222499998,119550.21902999999,135248.73264,-1,159110.92901699999,-1,-1,-1,-1,-1,-1,-1,115903.56140549999,-1,-1,-1,-1,-1,-1,null,null,"Ropa DamaChaqueta casual o sport.13"]
["Ropa Dama","Chaqueta de jean",1,3,{"$f":"ROUND(AVERAGE(IF(F125:Z125>-1,F125:Z125)),0)","v":125409},159400.29203999997,113029.29799199999,138267.67756499999,107474.43932999999,123172.95294,-1,99118.22762249998,-1,-1,-1,-1,-1,-1,-1,137398.44927149999,-1,-1,-1,-1,-1,-1,null,null,"Ropa DamaChaqueta de jean13"]
["Ropa Dama","Falda",1,3,{"$f":"ROUND(AVERAGE(IF(F126:Z126>-1,F126:Z126)),0)","v":72946},85013.489088000002,69073.459883999996,68228.155304999993,67020.577334999994,60378.898499999996,-1,91292.894531999991,-1,-1,-1,-1,-1,-1,-1,69616.869970499989,-1,-1,-1,-1,-1,-1,null,null,"Ropa DamaFalda13"]
["Ropa Dama","Gabán o abrigo para dama",1,3,{"$f":"ROUND(AVERAGE(IF(F127:Z127>-1,F127:Z127)),0)","v":202080},236443.76652599999,214755.21049499998,210722.35576499999,206495.83286999998,193212.47519999999,-1,143460.26283600001,-1,-1,-1,-1,-1,-1,-1,209466.93036599999,-1,-1,-1,-1,-1,-1,null,null,"Ropa DamaGabán o abrigo para dama13"]
["Ropa Dama","Pantalón formal",1,3,{"$f":"ROUND(AVERAGE(IF(F128:Z128>-1,F128:Z128)),0)","v":85186},86341.824854999999,83417.435563499996,81511.512975000005,81994.544162999999,74869.834139999992,-1,103030.32455549999,-1,-1,-1,-1,-1,-1,-1,85134.246884999986,-1,-1,-1,-1,-1,-1,null,null,"Ropa DamaPantalón formal13"]
["Ropa Dama","Pantalón drill formal",1,3,{"$f":"ROUND(AVERAGE(IF(F129:Z129>-1,F129:Z129)),0)","v":80390},85013.489088000002,75352.865327999985,74266.045155,72333.920402999996,96606.237599999993,-1,84771.973494000005,-1,-1,-1,-1,-1,-1,-1,74386.802951999998,-1,-1,-1,-1,-1,-1,null,null,"Ropa DamaPantalón drill formal13"]
["Ropa Dama","Jean clásico",1,3,{"$f":"ROUND(AVERAGE(IF(F130:Z130>-1,F130:Z130)),0)","v":72313},86341.824854999999,60282.064417499991,59775.109514999996,58157.410724999994,96606.237599999993,-1,84771.973494000005,-1,-1,-1,-1,-1,-1,-1,60258.14070299999,-1,-1,-1,-1,-1,-1,null,null,{"$f":"A130&B130&C130&D130","v":"Ropa DamaJean clásico13"}]
["Ropa Dama","Jean informal",1,3,{"$f":"ROUND(AVERAGE(IF(F131:Z131>-1,F131:Z131)),0)","v":89882},126191.89786499999,72840.875305499983,71850.889215000003,69918.764463,106266.86135999998,-1,110855.65764599999,-1,-1,-1,-1,-1,-1,-1,71247.100229999996,-1,-1,-1,-1,-1,-1,null,null,"Ropa DamaJean informal13"]
["Ropa Dama","Camisa tipo polo",1,3,{"$f":"ROUND(AVERAGE(IF(F132:Z132>-1,F132:Z132)),0)","v":36766},38521.737242999996,31397.027219999996,30793.238235000001,30793.238235000001,43472.806919999995,-1,50862.9562515,-1,-1,-1,-1,-1,-1,-1,31517.785016999998,-1,-1,-1,-1,-1,-1,null,null,"Ropa DamaCamisa tipo polo13"]
["Ropa Dama","Camiseta tipo T-shirt básica",1,3,{"$f":"ROUND(AVERAGE(IF(F133:Z133>-1,F133:Z133)),0)","v":20726},17932.532854500001,16326.226309499998,16302.302594999997,15577.755812999998,28981.871279999999,-1,33778.006425,-1,-1,-1,-1,-1,-1,-1,16181.544797999999,-1,-1,-1,-1,-1,-1,null,null,"Ropa DamaCamiseta tipo T-shirt básica13"]
["Ropa Dama","Bata o blusa labor",1,3,{"$f":"ROUND(AVERAGE(IF(F134:Z134>-1,F134:Z134)),0)","v":42095},46491.751844999999,31397.027219999996,32000.816204999996,30068.691452999996,43472.806919999995,-1,76816.768810499998,-1,-1,-1,-1,-1,-1,-1,34415.972145,-1,-1,-1,-1,-1,-1,null,null,"Ropa DamaBata o blusa labor13"]
["Ropa Dama","Pashmina",1,3,{"$f":"ROUND(AVERAGE(IF(F135:Z135>-1,F135:Z135)),0)","v":29323},11955.021902999999,25117.621775999996,25962.926354999996,24151.559399999998,28981.871279999999,-1,59992.701394499993,-1,-1,-1,-1,-1,-1,-1,29102.629076999998,-1,-1,-1,-1,-1,-1,null,null,"Ropa DamaPashmina13"]
["Ropa Dama","Vestido",1,3,{"$f":"ROUND(AVERAGE(IF(F136:Z136>-1,F136:Z136)),0)","v":152034},96968.510990999988,163264.54154399998,160004.08102499999,158796.50305499998,156985.1361,-1,169543.94698800001,-1,-1,-1,-1,-1,-1,-1,158675.74525800001,-1,-1,-1,-1,-1,-1,null,null,"Ropa DamaVestido13"]
["Ropa Dama","Logo corporativo (tamaño bolsillo)",1,3,{"$f":"ROUND(AVERAGE(IF(F137:Z137>-1,F137:Z137)),0)","v":7495},4830.3118799999993,6279.4054439999991,7003.9522259999994,5917.1320530000003,12075.779699999999,-1,8868.8627324999998,-1,-1,-1,-1,-1,-1,-1,7486.9834139999994,-1,-1,-1,-1,-1,-1,null,null,"Ropa DamaLogo corporativo (tamaño bolsillo)13"]
["Ropa Dama","Logo corporativo (tamaño espalda)",1,3,{"$f":"ROUND(AVERAGE(IF(F138:Z138>-1,F138:Z138)),0)","v":13555},14490.93564,12935.8941975,12317.295293999998,11955.021902999999,16906.09158,-1,14085.371718,-1,-1,-1,-1,-1,-1,-1,12196.537496999999,-1,-1,-1,-1,-1,-1,null,null,"Ropa DamaLogo corporativo (tamaño espalda)13"]
["Ropa Caballero","Vestido formal de dos piezas para hombre: saco y pantalón (Opción uno).",1,3,{"$f":"ROUND(AVERAGE(IF(F139:Z139>-1,F139:Z139)),0)","v":279904},-1,238617.40687199999,233304.06380399998,301773.73470299999,-1,-1,-1,-1,-1,-1,-1,-1,-1,389081.621934,236745.66101849999,-1,-1,-1,-1,-1,-1,null,null,"Ropa CaballeroVestido formal de dos piezas para hombre: saco y pantalón (Opción uno).13"]
["Ropa Caballero","Vestido formal de dos piezas para hombre: saco y pantalón (Opción dos).",1,3,{"$f":"ROUND(AVERAGE(IF(F140:Z140>-1,F140:Z140)),0)","v":256881},-1,226058.59598399999,221228.28410399996,264459.57542999997,-1,-1,-1,-1,-1,-1,-1,-1,-1,349956.09570599993,222701.30138249998,-1,-1,-1,-1,-1,-1,null,null,"Ropa CaballeroVestido formal de dos piezas para hombre: saco y pantalón (Opción dos).13"]
["Ropa Caballero","Camisa formal manga larga (Tipo uno, recomendable clima cálido).",1,3,{"$f":"ROUND(AVERAGE(IF(F141:Z141>-1,F141:Z141)),0)","v":67045},-1,62794.054439999993,61827.992063999998,62069.507657999995,-1,-1,-1,-1,-1,-1,-1,-1,-1,85858.793666999991,62673.296642999994,-1,-1,-1,-1,-1,-1,null,null,"Ropa CaballeroCamisa formal manga larga (Tipo uno, recomendable clima cálido).13"]
["Ropa Caballero","Camisa formal manga corta (Tipo uno, recomendable clima cálido).",1,3,{"$f":"ROUND(AVERAGE(IF(F142:Z142>-1,F142:Z142)),0)","v":61118},-1,56514.648995999996,55790.102213999999,56152.375604999994,-1,-1,-1,-1,-1,-1,-1,-1,-1,81511.512975000005,55621.496987999999,-1,-1,-1,-1,-1,-1,null,null,"Ropa CaballeroCamisa formal manga corta (Tipo uno, recomendable clima cálido).13"]
["Ropa Caballero","Camisa formal manga larga para caballero (Tipo dos).",1,3,{"$f":"ROUND(AVERAGE(IF(F143:Z143>-1,F143:Z143)),0)","v":69025},-1,62794.054439999993,61827.992063999998,62190.265454999993,-1,-1,-1,-1,-1,-1,-1,-1,-1,95640.175223999991,62673.296642999994,-1,-1,-1,-1,-1,-1,null,null,"Ropa CaballeroCamisa formal manga larga para caballero (Tipo dos).13"]
["Ropa Caballero","Camisa formal manga corta para caballero (Tipo dos).",1,3,{"$f":"ROUND(AVERAGE(IF(F144:Z144>-1,F144:Z144)),0)","v":62640},-1,56514.648995999996,55790.102213999999,56152.375604999994,-1,-1,-1,-1,-1,-1,-1,-1,-1,89119.254185999991,55621.496987999999,-1,-1,-1,-1,-1,-1,null,null,"Ropa CaballeroCamisa formal manga corta para caballero (Tipo dos).13"]
["Ropa Caballero","Corbata",1,3,{"$f":"ROUND(AVERAGE(IF(F145:Z145>-1,F145:Z145)),0)","v":24879},-1,18838.216331999996,18355.185143999999,22823.223632999998,-1,-1,-1,-1,-1,-1,-1,-1,-1,39125.526228000002,25250.911042499996,-1,-1,-1,-1,-1,-1,null,null,"Ropa CaballeroCorbata13"]
["Ropa Caballero","Chaqueta casual o sport.",1,3,{"$f":"ROUND(AVERAGE(IF(F146:Z146>-1,F146:Z146)),0)","v":114715},-1,96703.071682499984,95640.175223999991,107957.47051799999,-1,-1,-1,-1,-1,-1,-1,-1,-1,176064.86802599998,97210.026584999985,-1,-1,-1,-1,-1,-1,null,null,"Ropa CaballeroChaqueta casual o sport.13"]
["Ropa Caballero","Chaqueta de jean",1,3,{"$f":"ROUND(AVERAGE(IF(F147:Z147>-1,F147:Z147)),0)","v":118215},-1,109261.88257049999,111338.688834,107353.68153299998,-1,-1,-1,-1,-1,-1,-1,-1,-1,152154.82421999998,110963.88397349999,-1,-1,-1,-1,-1,-1,null,null,"Ropa CaballeroChaqueta de jean13"]
["Ropa Caballero","Chaqueta de drill",1,3,{"$f":"ROUND(AVERAGE(IF(F148:Z148>-1,F148:Z148)),0)","v":117360},-1,113029.29799199999,106508.37695399998,107353.68153299998,-1,-1,-1,-1,-1,-1,-1,-1,-1,152154.82421999998,107752.41010799998,-1,-1,-1,-1,-1,-1,null,null,"Ropa CaballeroChaqueta de drill13"]
["Ropa Caballero","Blazer para hombre.",1,3,{"$f":"ROUND(AVERAGE(IF(F149:Z149>-1,F149:Z149)),0)","v":183818},-1,169543.94698800001,166887.27545399999,216156.45663,-1,-1,-1,-1,-1,-1,-1,-1,-1,195627.63113999998,170872.28275499999,-1,-1,-1,-1,-1,-1,null,null,"Ropa CaballeroBlazer para hombre.13"]
["Ropa Caballero","Camisa sport o informal",1,3,{"$f":"ROUND(AVERAGE(IF(F150:Z150>-1,F150:Z150)),0)","v":63666},-1,62794.054439999993,61827.992063999998,61465.718672999988,-1,-1,-1,-1,-1,-1,-1,-1,-1,69556.49107199999,62685.828112499992,-1,-1,-1,-1,-1,-1,null,null,"Ropa CaballeroCamisa sport o informal13"]
["Ropa Caballero","Camiseta tipo t-shirt blanca",1,3,{"$f":"ROUND(AVERAGE(IF(F151:Z151>-1,F151:Z151)),0)","v":16897},-1,11303.385488999998,12317.295293999998,11471.990714999998,-1,-1,-1,-1,-1,-1,-1,-1,-1,36951.885881999995,12438.053091,-1,-1,-1,-1,-1,-1,null,null,"Ropa CaballeroCamiseta tipo t-shirt blanca13"]
["Ropa Caballero","Camiseta tipo t-shirt estampada",1,3,{"$f":"ROUND(AVERAGE(IF(F152:Z152>-1,F152:Z152)),0)","v":20867},-1,15070.8009105,14732.451233999998,20408.067692999997,-1,-1,-1,-1,-1,-1,-1,-1,-1,39125.526228000002,14997.890542499999,-1,-1,-1,-1,-1,-1,null,null,"Ropa CaballeroCamiseta tipo t-shirt estampada13"]
["Ropa Caballero","Camisa tipo polo",1,3,{"$f":"ROUND(AVERAGE(IF(F153:Z153>-1,F153:Z153)),0)","v":34150},-1,31397.027219999996,30430.964843999998,30793.238235000001,-1,-1,-1,-1,-1,-1,-1,-1,-1,47820.087611999996,30310.207047,-1,-1,-1,-1,-1,-1,null,null,"Ropa CaballeroCamisa tipo polo13"]
["Ropa Caballero","Pantalón de dril formal",1,3,{"$f":"ROUND(AVERAGE(IF(F154:Z154>-1,F154:Z154)),0)","v":72889},-1,69073.459883999996,67865.881913999998,66296.03055299999,-1,-1,-1,-1,-1,-1,-1,-1,-1,91292.894531999991,69918.764463,-1,-1,-1,-1,-1,-1,null,null,"Ropa CaballeroPantalón de dril formal13"]
["Ropa Caballero","Jean clásico",1,3,{"$f":"ROUND(AVERAGE(IF(F155:Z155>-1,F155:Z155)),0)","v":62130},-1,56514.648995999996,55790.102213999999,54220.25085299999,-1,-1,-1,-1,-1,-1,-1,-1,-1,89119.254185999991,55005.176533499995,-1,-1,-1,-1,-1,-1,null,null,"Ropa CaballeroJean clásico13"]
["Ropa Caballero","Jean informal",1,3,{"$f":"ROUND(AVERAGE(IF(F156:Z156>-1,F156:Z156)),0)","v":69979},-1,62794.054439999993,61827.992063999998,60258.14070299999,-1,-1,-1,-1,-1,-1,-1,-1,-1,102161.09626199999,62854.433338499992,-1,-1,-1,-1,-1,-1,null,null,"Ropa CaballeroJean informal13"]
["Ropa Caballero","Bata o blusa labor",1,3,{"$f":"ROUND(AVERAGE(IF(F157:Z157>-1,F157:Z157)),0)","v":30185},-1,11931.098188499998,31638.542813999997,31276.269422999998,-1,-1,-1,-1,-1,-1,-1,-1,-1,41299.166574000003,34778.245535999995,-1,-1,-1,-1,-1,-1,null,null,"Ropa CaballeroBata o blusa labor13"]
["Ropa Caballero","Calcetín para calzado calle",1,3,{"$f":"ROUND(AVERAGE(IF(F158:Z158>-1,F158:Z158)),0)","v":12400},-1,11303.385488999998,11109.717323999999,10868.201729999999,-1,-1,-1,-1,-1,-1,-1,-1,-1,17389.122767999997,11327.309203499999,-1,-1,-1,-1,-1,-1,null,null,"Ropa CaballeroCalcetín para calzado calle13"]
["Ropa Caballero","Calcetín para calzado deportivo",1,3,{"$f":"ROUND(AVERAGE(IF(F159:Z159>-1,F159:Z159)),0)","v":12622},-1,11931.098188499998,11109.717323999999,11351.232918,-1,-1,-1,-1,-1,-1,-1,-1,-1,17389.122767999997,11327.309203499999,-1,-1,-1,-1,-1,-1,null,null,"Ropa CaballeroCalcetín para calzado deportivo13"]
["Ropa Caballero","Pantaloncillo tipo bóxer.",1,3,{"$f":"ROUND(AVERAGE(IF(F160:Z160>-1,F160:Z160)),0)","v":19906},-1,31397.027219999996,12317.295293999998,15577.755812999998,-1,-1,-1,-1,-1,-1,-1,-1,-1,28257.324497999998,11978.9456175,-1,-1,-1,-1,-1,-1,null,null,"Ropa CaballeroPantaloncillo tipo bóxer.13"]
["Ropa Caballero","Gorra o cachucha",1,3,{"$f":"ROUND(AVERAGE(IF(F161:Z161>-1,F161:Z161)),0)","v":20152},-1,18838.216331999996,19562.763114000001,22823.223632999998,-1,-1,-1,-1,-1,-1,-1,-1,-1,19562.763114000001,19972.883933999998,-1,-1,-1,-1,-1,-1,null,null,"Ropa CaballeroGorra o cachucha13"]
["Ropa Caballero","Tula / Morral",1,3,{"$f":"ROUND(AVERAGE(IF(F162:Z162>-1,F162:Z162)),0)","v":76012},-1,71585.449906499998,70281.037853999995,70039.522259999998,-1,-1,-1,-1,-1,-1,-1,-1,-1,95640.175223999991,72515.057098499994,-1,-1,-1,-1,-1,-1,null,null,"Ropa CaballeroTula / Morral13"]
["Ropa Caballero","Logo corporativo (tamaño bolsillo)",1,3,{"$f":"ROUND(AVERAGE(IF(F163:Z163>-1,F163:Z163)),0)","v":7019},-1,6279.4054439999991,7003.9522259999994,5917.1320530000003,-1,-1,-1,-1,-1,-1,-1,-1,-1,8694.5613839999987,7197.6203909999995,-1,-1,-1,-1,-1,-1,null,null,"Ropa CaballeroLogo corporativo (tamaño bolsillo)13"]
["Ropa Caballero","Logo corporativo (tamaño espalda)",1,3,{"$f":"ROUND(AVERAGE(IF(F164:Z164>-1,F164:Z164)),0)","v":12834},-1,12558.810887999998,12317.295293999998,11955.021902999999,-1,-1,-1,-1,-1,-1,-1,-1,-1,15215.482421999999,12123.627128999999,-1,-1,-1,-1,-1,-1,null,null,"Ropa CaballeroLogo corporativo (tamaño espalda)13"]
["Calzado Dama","Calzado de calle para dama.",1,3,{"$f":"ROUND(AVERAGE(IF(F165:Z165>-1,F165:Z165)),0)","v":109846},-1,-1,88394.707403999986,96485.479802999995,114719.90714999998,-1,-1,-1,-1,-1,-1,-1,-1,106266.86135999998,-1,-1,144788.59860299999,-1,92681.609197499987,125588.10887999999,-1,null,null,"Calzado DamaCalzado de calle para dama.13"]
["Calzado Dama","Calzado casual para dama.",1,3,{"$f":"ROUND(AVERAGE(IF(F166:Z166>-1,F166:Z166)),0)","v":107164},-1,-1,89119.254185999991,89964.558764999994,114719.90714999998,-1,-1,-1,-1,-1,-1,-1,-1,106266.86135999998,-1,-1,144788.59860299999,-1,90568.347750000001,114719.90714999998,-1,null,null,"Calzado DamaCalzado casual para dama.13"]
["Calzado Dama","Calzado de calle para dama clima cálido.",1,3,{"$f":"ROUND(AVERAGE(IF(F167:Z167>-1,F167:Z167)),0)","v":109106},-1,-1,89964.558764999994,96485.479802999995,114719.90714999998,-1,-1,-1,-1,-1,-1,-1,-1,106266.86135999998,-1,-1,144788.59860299999,-1,93177.171854999993,118342.64105999999,-1,null,null,"Calzado DamaCalzado de calle para dama clima cálido.13"]
["Calzado Dama","Cinturón.",1,3,{"$f":"ROUND(AVERAGE(IF(F168:Z168>-1,F168:Z168)),0)","v":40016},-1,-1,30672.480437999995,33691.425362999995,42265.228949999997,-1,-1,-1,-1,-1,-1,-1,-1,36227.339099999997,-1,-1,42144.471152999991,-1,32315.242166999997,62794.054439999993,-1,null,null,"Calzado DamaCinturón.13"]
["Calzado Caballero","Calzado de calle para caballero formal.",1,3,{"$f":"ROUND(AVERAGE(IF(F169:Z169>-1,F169:Z169)),0)","v":116048},-1,-1,98055.331163999988,99021.39353999999,-1,-1,-1,-1,-1,-1,-1,-1,-1,111097.17324,-1,-1,156864.37830299998,120154.008015,102764.885247,124380.53090999999,-1,null,null,"Calzado CaballeroCalzado de calle para caballero formal.13"]
["Calzado Caballero","Calzado deportivo para caballero",1,3,{"$f":"ROUND(AVERAGE(IF(F170:Z170>-1,F170:Z170)),0)","v":117032},-1,-1,106508.37695399998,105663.07237499999,-1,-1,-1,-1,-1,-1,-1,-1,-1,111097.17324,-1,-1,156864.37830299998,111700.96222499998,111459.44663099998,115927.48512,-1,null,null,"Calzado CaballeroCalzado deportivo para caballero13"]
["Calzado Caballero","Calzado casual para caballero.",1,3,{"$f":"ROUND(AVERAGE(IF(F171:Z171>-1,F171:Z171)),0)","v":116411},-1,-1,106508.37695399998,96485.479802999995,-1,-1,-1,-1,-1,-1,-1,-1,-1,111097.17324,-1,-1,156864.37830299998,114116.11816499999,111459.44663099998,118342.64105999999,-1,null,null,"Calzado CaballeroCalzado casual para caballero.13"]
["Calzado Caballero","Cinturón",1,3,{"$f":"ROUND(AVERAGE(IF(F172:Z172>-1,F172:Z172)),0)","v":41832},-1,-1,29223.386874,33691.425362999995,-1,-1,-1,-1,-1,-1,-1,-1,-1,36227.339099999997,-1,-1,42144.471152999991,57963.742559999999,30780.706765499996,62794.054439999993,-1,null,null,"Calzado CaballeroCinturón13"]
["Ropa Dama","Sastre formal de dos piezas para dama: chaqueta y falda o pantalón (Opción Uno).",1,4,{"$f":"ROUND(AVERAGE(IF(F173:Z173>-1,F173:Z173)),0)","v":226009},241757.10959399998,213499.78509600001,209514.77779499997,228232.23632999999,227024.65836,-1,247125.135438,-1,-1,-1,-1,-1,-1,-1,214912.423476,-1,-1,-1,-1,-1,-1,null,null,"Ropa DamaSastre formal de dos piezas para dama: chaqueta y falda o pantalón (Opción Uno).14"]
["Ropa Dama","Sastre formal de dos piezas para dama: chaqueta y falda o pantalón (Opción Dos).",1,4,{"$f":"ROUND(AVERAGE(IF(F174:Z174>-1,F174:Z174)),0)","v":204702},179192.03927849996,210987.79507349999,207099.621855,202873.09895999997,202873.09895999997,-1,215552.66764499998,-1,-1,-1,-1,-1,-1,-1,214332.55820549998,-1,-1,-1,-1,-1,-1,null,null,"Ropa DamaSastre formal de dos piezas para dama: chaqueta y falda o pantalón (Opción Dos).14"]
["Ropa Dama","Sastre formal de tres piezas para dama: chaqueta, chaleco y falda o pantalón.",1,4,{"$f":"ROUND(AVERAGE(IF(F175:Z175>-1,F175:Z175)),0)","v":292079},363964.00015799998,270014.43409199995,265063.36441499996,295856.60265000002,265667.15339999995,-1,316989.21712500002,-1,-1,-1,-1,-1,-1,-1,266995.48916699993,-1,-1,-1,-1,-1,-1,null,null,"Ropa DamaSastre formal de tres piezas para dama: chaqueta, chaleco y falda o pantalón.14"]
["Ropa Dama","Blazer para dama.",1,4,{"$f":"ROUND(AVERAGE(IF(F176:Z176>-1,F176:Z176)),0)","v":180360},164314.906533,194661.568764,191401.10824499998,199250.36504999999,147324.51233999999,-1,171174.17724749999,-1,-1,-1,-1,-1,-1,-1,194396.12945549999,-1,-1,-1,-1,-1,-1,null,null,"Ropa DamaBlazer para dama.14"]
["Ropa Dama","Blusa formal manga larga para dama.",1,4,{"$f":"ROUND(AVERAGE(IF(F177:Z177>-1,F177:Z177)),0)","v":69987},63494.677507499997,71023.812227999995,69435.733274999991,69435.733274999991,57963.742559999999,-1,87489.023926499984,-1,-1,-1,-1,-1,-1,-1,71065.963534499984,-1,-1,-1,-1,-1,-1,null,null,"Ropa DamaBlusa formal manga larga para dama.14"]
["Ropa Dama","Blusa formal manga corta para dama.",1,4,{"$f":"ROUND(AVERAGE(IF(F178:Z178>-1,F178:Z178)),0)","v":66479},62166.341740499993,68509.543756500003,67020.577334999994,67020.577334999994,55548.586620000002,-1,78613.325846999986,-1,-1,-1,-1,-1,-1,-1,66477.167248500002,-1,-1,-1,-1,-1,-1,null,null,"Ropa DamaBlusa formal manga corta para dama.14"]
["Ropa Dama","Blusa sport o informal para dama.",1,4,{"$f":"ROUND(AVERAGE(IF(F179:Z179>-1,F179:Z179)),0)","v":68360},74386.802951999998,67639.176238499989,67020.577334999994,65812.999364999996,57963.742559999999,-1,78613.325846999986,-1,-1,-1,-1,-1,-1,-1,67080.956233499994,-1,-1,-1,-1,-1,-1,null,null,"Ropa DamaBlusa sport o informal para dama.14"]
["Ropa Dama","Blusa para dama.",1,4,{"$f":"ROUND(AVERAGE(IF(F180:Z180>-1,F180:Z180)),0)","v":66403},55790.102213999999,72840.875305499983,71850.889215000003,70884.826839000001,57963.742559999999,-1,69737.627767499987,-1,-1,-1,-1,-1,-1,-1,65752.620466499997,-1,-1,-1,-1,-1,-1,null,null,"Ropa DamaBlusa para dama.14"]
["Ropa Dama","Chaqueta casual o sport.",1,4,{"$f":"ROUND(AVERAGE(IF(F181:Z181>-1,F181:Z181)),0)","v":123071},110118.57939449999,114284.72339099999,111700.96222499998,119550.21902999999,135248.73264,-1,154690.73795699998,-1,-1,-1,-1,-1,-1,-1,115903.56140549999,-1,-1,-1,-1,-1,-1,null,null,"Ropa DamaChaqueta casual o sport.14"]
["Ropa Dama","Chaqueta de jean",1,4,{"$f":"ROUND(AVERAGE(IF(F182:Z182>-1,F182:Z182)),0)","v":125015},159400.29203999997,113029.29799199999,138267.67756499999,107474.43932999999,123172.95294,-1,96364.722005999982,-1,-1,-1,-1,-1,-1,-1,137398.44927149999,-1,-1,-1,-1,-1,-1,null,null,"Ropa DamaChaqueta de jean14"]
["Ropa Dama","Falda",1,4,{"$f":"ROUND(AVERAGE(IF(F183:Z183>-1,F183:Z183)),0)","v":72584},85013.489088000002,69073.459883999996,68228.155304999993,67020.577334999994,60378.898499999996,-1,88756.980794999996,-1,-1,-1,-1,-1,-1,-1,69616.869970499989,-1,-1,-1,-1,-1,-1,null,null,"Ropa DamaFalda14"]
["Ropa Dama","Gabán o abrigo para dama",1,4,{"$f":"ROUND(AVERAGE(IF(F184:Z184>-1,F184:Z184)),0)","v":201510},236443.76652599999,214755.21049499998,210722.35576499999,206495.83286999998,193212.47519999999,-1,139475.25553499997,-1,-1,-1,-1,-1,-1,-1,209466.93036599999,-1,-1,-1,-1,-1,-1,null,null,"Ropa DamaGabán o abrigo para dama14"]
["Ropa Dama","Pantalón formal",1,4,{"$f":"ROUND(AVERAGE(IF(F185:Z185>-1,F185:Z185)),0)","v":84777},86341.824854999999,83417.435563499996,81511.512975000005,81994.544162999999,74869.834139999992,-1,100168.59261149999,-1,-1,-1,-1,-1,-1,-1,85134.246884999986,-1,-1,-1,-1,-1,-1,null,null,"Ropa DamaPantalón formal14"]
["Ropa Dama","Pantalón drill formal",1,4,{"$f":"ROUND(AVERAGE(IF(F186:Z186>-1,F186:Z186)),0)","v":80054},85013.489088000002,75352.865327999985,74266.045155,72333.920402999996,96606.237599999993,-1,82417.196452499993,-1,-1,-1,-1,-1,-1,-1,74386.802951999998,-1,-1,-1,-1,-1,-1,null,null,"Ropa DamaPantalón drill formal14"]
["Ropa Dama","Jean clásico",1,4,{"$f":"ROUND(AVERAGE(IF(F187:Z187>-1,F187:Z187)),0)","v":71977},86341.824854999999,60282.064417499991,59775.109514999996,58157.410724999994,96606.237599999993,-1,82417.196452499993,-1,-1,-1,-1,-1,-1,-1,60258.14070299999,-1,-1,-1,-1,-1,-1,null,null,"Ropa DamaJean clásico14"]
["Ropa Dama","Jean informal",1,4,{"$f":"ROUND(AVERAGE(IF(F188:Z188>-1,F188:Z188)),0)","v":89442},126191.89786499999,72840.875305499983,71850.889215000003,69918.764463,106266.86135999998,-1,107776.33382249999,-1,-1,-1,-1,-1,-1,-1,71247.100229999996,-1,-1,-1,-1,-1,-1,null,null,"Ropa DamaJean informal14"]
["Ropa Dama","Camisa tipo polo",1,4,{"$f":"ROUND(AVERAGE(IF(F189:Z189>-1,F189:Z189)),0)","v":36564},38521.737242999996,31397.027219999996,30793.238235000001,30793.238235000001,43472.806919999995,-1,49450.317871499996,-1,-1,-1,-1,-1,-1,-1,31517.785016999998,-1,-1,-1,-1,-1,-1,null,null,"Ropa DamaCamisa tipo polo14"]
["Ropa Dama","Camiseta tipo T-shirt básica",1,4,{"$f":"ROUND(AVERAGE(IF(F190:Z190>-1,F190:Z190)),0)","v":20592},17932.532854500001,16326.226309499998,16302.302594999997,15577.755812999998,28981.871279999999,-1,32840.424661499994,-1,-1,-1,-1,-1,-1,-1,16181.544797999999,-1,-1,-1,-1,-1,-1,null,null,"Ropa DamaCamiseta tipo T-shirt básica14"]
["Ropa Dama","Bata o blusa labor",1,4,{"$f":"ROUND(AVERAGE(IF(F191:Z191>-1,F191:Z191)),0)","v":41790},46491.751844999999,31397.027219999996,32000.816204999996,30068.691452999996,43472.806919999995,-1,74683.001321999996,-1,-1,-1,-1,-1,-1,-1,34415.972145,-1,-1,-1,-1,-1,-1,null,null,"Ropa DamaBata o blusa labor14"]
["Ropa Dama","Pashmina",1,4,{"$f":"ROUND(AVERAGE(IF(F192:Z192>-1,F192:Z192)),0)","v":29085},11955.021902999999,25117.621775999996,25962.926354999996,24151.559399999998,28981.871279999999,-1,58326.015950999994,-1,-1,-1,-1,-1,-1,-1,29102.629076999998,-1,-1,-1,-1,-1,-1,null,null,"Ropa DamaPashmina14"]
["Ropa Dama","Vestido",1,4,{"$f":"ROUND(AVERAGE(IF(F193:Z193>-1,F193:Z193)),0)","v":151361},96968.510990999988,163264.54154399998,160004.08102499999,158796.50305499998,156985.1361,-1,164834.39290499999,-1,-1,-1,-1,-1,-1,-1,158675.74525800001,-1,-1,-1,-1,-1,-1,null,null,"Ropa DamaVestido14"]
["Ropa Dama","Logo corporativo (tamaño bolsillo)",1,4,{"$f":"ROUND(AVERAGE(IF(F194:Z194>-1,F194:Z194)),0)","v":7459},4830.3118799999993,6279.4054439999991,7003.9522259999994,5917.1320530000003,12075.779699999999,-1,8621.6510159999998,-1,-1,-1,-1,-1,-1,-1,7486.9834139999994,-1,-1,-1,-1,-1,-1,null,null,{"$f":"A194&B194&C194&D194","v":"Ropa DamaLogo corporativo (tamaño bolsillo)14"}]
["Ropa Dama","Logo corporativo (tamaño espalda)",1,4,{"$f":"ROUND(AVERAGE(IF(F195:Z195>-1,F195:Z195)),0)","v":13499},14490.93564,12935.8941975,12317.295293999998,11955.021902999999,16906.09158,-1,13693.47849,-1,-1,-1,-1,-1,-1,-1,12196.537496999999,-1,-1,-1,-1,-1,-1,null,null,"Ropa DamaLogo corporativo (tamaño espalda)14"]
["Ropa Caballero","Vestido formal de dos piezas para hombre: saco y pantalón (Opción uno).",1,4,{"$f":"ROUND(AVERAGE(IF(F196:Z196>-1,F196:Z196)),0)","v":279904},-1,238617.40687199999,233304.06380399998,301773.73470299999,-1,-1,-1,-1,-1,-1,-1,-1,-1,389081.621934,236745.66101849999,-1,-1,-1,-1,-1,-1,null,null,"Ropa CaballeroVestido formal de dos piezas para hombre: saco y pantalón (Opción uno).14"]
["Ropa Caballero","Vestido formal de dos piezas para hombre: saco y pantalón (Opción dos).",1,4,{"$f":"ROUND(AVERAGE(IF(F197:Z197>-1,F197:Z197)),0)","v":256881},-1,226058.59598399999,221228.28410399996,264459.57542999997,-1,-1,-1,-1,-1,-1,-1,-1,-1,349956.09570599993,222701.30138249998,-1,-1,-1,-1,-1,-1,null,null,"Ropa CaballeroVestido formal de dos piezas para hombre: saco y pantalón (Opción dos).14"]
["Ropa Caballero","Camisa formal manga larga (Tipo uno, recomendable clima cálido).",1,4,{"$f":"ROUND(AVERAGE(IF(F198:Z198>-1,F198:Z198)),0)","v":67045},-1,62794.054439999993,61827.992063999998,62069.507657999995,-1,-1,-1,-1,-1,-1,-1,-1,-1,85858.793666999991,62673.296642999994,-1,-1,-1,-1,-1,-1,null,null,"Ropa CaballeroCamisa formal manga larga (Tipo uno, recomendable clima cálido).14"]
["Ropa Caballero","Camisa formal manga corta (Tipo uno, recomendable clima cálido).",1,4,{"$f":"ROUND(AVERAGE(IF(F199:Z199>-1,F199:Z199)),0)","v":61118},-1,56514.648995999996,55790.102213999999,56152.375604999994,-1,-1,-1,-1,-1,-1,-1,-1,-1,81511.512975000005,55621.496987999999,-1,-1,-1,-1,-1,-1,null,null,"Ropa CaballeroCamisa formal manga corta (Tipo uno, recomendable clima cálido).14"]
["Ropa Caballero","Camisa formal manga larga para caballero (Tipo dos).",1,4,{"$f":"ROUND(AVERAGE(IF(F200:Z200>-1,F200:Z200)),0)","v":69025},-1,62794.054439999993,61827.992063999998,62190.265454999993,-1,-1,-1,-1,-1,-1,-1,-1,-1,95640.175223999991,62673.296642999994,-1,-1,-1,-1,-1,-1,null,null,"Ropa CaballeroCamisa formal manga larga para caballero (Tipo dos).14"]
["Ropa Caballero","Camisa formal manga corta para caballero (Tipo dos).",1,4,{"$f":"ROUND(AVERAGE(IF(F201:Z201>-1,F201:Z201)),0)","v":62640},-1,56514.648995999996,55790.102213999999,56152.375604999994,-1,-1,-1,-1,-1,-1,-1,-1,-1,89119.254185999991,55621.496987999999,-1,-1,-1,-1,-1,-1,null,null,"Ropa CaballeroCamisa formal manga corta para caballero (Tipo dos).14"]
["Ropa Caballero","Corbata",1,4,{"$f":"ROUND(AVERAGE(IF(F202:Z202>-1,F202:Z202)),0)","v":24879},-1,18838.216331999996,18355.185143999999,22823.223632999998,-1,-1,-1,-1,-1,-1,-1,-1,-1,39125.526228000002,25250.911042499996,-1,-1,-1,-1,-1,-1,null,null,"Ropa CaballeroCorbata14"]
["Ropa Caballero","Chaqueta casual o sport.",1,4,{"$f":"ROUND(AVERAGE(IF(F203:Z203>-1,F203:Z203)),0)","v":114715},-1,96703.071682499984,95640.175223999991,107957.47051799999,-1,-1,-1,-1,-1,-1,-1,-1,-1,176064.86802599998,97210.026584999985,-1,-1,-1,-1,-1,-1,null,null,"Ropa CaballeroChaqueta casual o sport.14"]
["Ropa Caballero","Chaqueta de jean",1,4,{"$f":"ROUND(AVERAGE(IF(F204:Z204>-1,F204:Z204)),0)","v":118215},-1,109261.88257049999,111338.688834,107353.68153299998,-1,-1,-1,-1,-1,-1,-1,-1,-1,152154.82421999998,110963.88397349999,-1,-1,-1,-1,-1,-1,null,null,"Ropa CaballeroChaqueta de jean14"]
["Ropa Caballero","Chaqueta de drill",1,4,{"$f":"ROUND(AVERAGE(IF(F205:Z205>-1,F205:Z205)),0)","v":117360},-1,113029.29799199999,106508.37695399998,107353.68153299998,-1,-1,-1,-1,-1,-1,-1,-1,-1,152154.82421999998,107752.41010799998,-1,-1,-1,-1,-1,-1,null,null,"Ropa CaballeroChaqueta de drill14"]
["Ropa Caballero","Blazer para hombre.",1,4,{"$f":"ROUND(AVERAGE(IF(F206:Z206>-1,F206:Z206)),0)","v":183818},-1,169543.94698800001,166887.27545399999,216156.45663,-1,-1,-1,-1,-1,-1,-1,-1,-1,195627.63113999998,170872.28275499999,-1,-1,-1,-1,-1,-1,null,null,"Ropa CaballeroBlazer para hombre.14"]
["Ropa Caballero","Camisa sport o informal",1,4,{"$f":"ROUND(AVERAGE(IF(F207:Z207>-1,F207:Z207)),0)","v":63666},-1,62794.054439999993,61827.992063999998,61465.718672999988,-1,-1,-1,-1,-1,-1,-1,-1,-1,69556.49107199999,62685.828112499992,-1,-1,-1,-1,-1,-1,null,null,"Ropa CaballeroCamisa sport o informal14"]
["Ropa Caballero","Camiseta tipo t-shirt blanca",1,4,{"$f":"ROUND(AVERAGE(IF(F208:Z208>-1,F208:Z208)),0)","v":16897},-1,11303.385488999998,12317.295293999998,11471.990714999998,-1,-1,-1,-1,-1,-1,-1,-1,-1,36951.885881999995,12438.053091,-1,-1,-1,-1,-1,-1,null,null,"Ropa CaballeroCamiseta tipo t-shirt blanca14"]
["Ropa Caballero","Camiseta tipo t-shirt estampada",1,4,{"$f":"ROUND(AVERAGE(IF(F209:Z209>-1,F209:Z209)),0)","v":20867},-1,15070.8009105,14732.451233999998,20408.067692999997,-1,-1,-1,-1,-1,-1,-1,-1,-1,39125.526228000002,14997.890542499999,-1,-1,-1,-1,-1,-1,null,null,"Ropa CaballeroCamiseta tipo t-shirt estampada14"]
["Ropa Caballero","Camisa tipo polo",1,4,{"$f":"ROUND(AVERAGE(IF(F210:Z210>-1,F210:Z210)),0)","v":34150},-1,31397.027219999996,30430.964843999998,30793.238235000001,-1,-1,-1,-1,-1,-1,-1,-1,-1,47820.087611999996,30310.207047,-1,-1,-1,-1,-1,-1,null,null,"Ropa CaballeroCamisa tipo polo14"]
["Ropa Caballero","Pantalón de dril formal",1,4,{"$f":"ROUND(AVERAGE(IF(F211:Z211>-1,F211:Z211)),0)","v":72889},-1,69073.459883999996,67865.881913999998,66296.03055299999,-1,-1,-1,-1,-1,-1,-1,-1,-1,91292.894531999991,69918.764463,-1,-1,-1,-1,-1,-1,null,null,"Ropa CaballeroPantalón de dril formal14"]
["Ropa Caballero","Jean clásico",1,4,{"$f":"ROUND(AVERAGE(IF(F212:Z212>-1,F212:Z212)),0)","v":62130},-1,56514.648995999996,55790.102213999999,54220.25085299999,-1,-1,-1,-1,-1,-1,-1,-1,-1,89119.254185999991,55005.176533499995,-1,-1,-1,-1,-1,-1,null,null,"Ropa CaballeroJean clásico14"]
["Ropa Caballero","Jean informal",1,4,{"$f":"ROUND(AVERAGE(IF(F213:Z213>-1,F213:Z213)),0)","v":69979},-1,62794.054439999993,61827.992063999998,60258.14070299999,-1,-1,-1,-1,-1,-1,-1,-1,-1,102161.09626199999,62854.433338499992,-1,-1,-1,-1,-1,-1,null,null,"Ropa CaballeroJean informal14"]
["Ropa Caballero","Bata o blusa labor",1,4,{"$f":"ROUND(AVERAGE(IF(F214:Z214>-1,F214:Z214)),0)","v":30185},-1,11931.098188499998,31638.542813999997,31276.269422999998,-1,-1,-1,-1,-1,-1,-1,-1,-1,41299.166574000003,34778.245535999995,-1,-1,-1,-1,-1,-1,null,null,"Ropa CaballeroBata o blusa labor14"]
["Ropa Caballero","Calcetín para calzado calle",1,4,{"$f":"ROUND(AVERAGE(IF(F215:Z215>-1,F215:Z215)),0)","v":12400},-1,11303.385488999998,11109.717323999999,10868.201729999999,-1,-1,-1,-1,-1,-1,-1,-1,-1,17389.122767999997,11327.309203499999,-1,-1,-1,-1,-1,-1,null,null,"Ropa CaballeroCalcetín para calzado calle14"]
["Ropa Caballero","Calcetín para calzado deportivo",1,4,{"$f":"ROUND(AVERAGE(IF(F216:Z216>-1,F216:Z216)),0)","v":12622},-1,11931.098188499998,11109.717323999999,11351.232918,-1,-1,-1,-1,-1,-1,-1,-1,-1,17389.122767999997,11327.309203499999,-1,-1,-1,-1,-1,-1,null,null,"Ropa CaballeroCalcetín para calzado deportivo14"]
["Ropa Caballero","Pantaloncillo tipo bóxer.",1,4,{"$f":"ROUND(AVERAGE(IF(F217:Z217>-1,F217:Z217)),0)","v":19906},-1,31397.027219999996,12317.295293999998,15577.755812999998,-1,-1,-1,-1,-1,-1,-1,-1,-1,28257.324497999998,11978.9456175,-1,-1,-1,-1,-1,-1,null,null,"Ropa CaballeroPantaloncillo tipo bóxer.14"]
["Ropa Caballero","Gorra o cachucha",1,4,{"$f":"ROUND(AVERAGE(IF(F218:Z218>-1,F218:Z218)),0)","v":20152},-1,18838.216331999996,19562.763114000001,22823.223632999998,-1,-1,-1,-1,-1,-1,-1,-1,-1,19562.763114000001,19972.883933999998,-1,-1,-1,-1,-1,-1,null,null,"Ropa CaballeroGorra o cachucha14"]
["Ropa Caballero","Tula / Morral",1,4,{"$f":"ROUND(AVERAGE(IF(F219:Z219>-1,F219:Z219)),0)","v":76012},-1,71585.449906499998,70281.037853999995,70039.522259999998,-1,-1,-1,-1,-1,-1,-1,-1,-1,95640.175223999991,72515.057098499994,-1,-1,-1,-1,-1,-1,null,null,"Ropa CaballeroTula / Morral14"]
["Ropa Caballero","Logo corporativo (tamaño bolsillo)",1,4,{"$f":"ROUND(AVERAGE(IF(F220:Z220>-1,F220:Z220)),0)","v":7019},-1,6279.4054439999991,7003.9522259999994,5917.1320530000003,-1,-1,-1,-1,-1,-1,-1,-1,-1,8694.5613839999987,7197.6203909999995,-1,-1,-1,-1,-1,-1,null,null,"Ropa CaballeroLogo corporativo (tamaño bolsillo)14"]
["Ropa Caballero","Logo corporativo (tamaño espalda)",1,4,{"$f":"ROUND(AVERAGE(IF(F221:Z221>-1,F221:Z221)),0)","v":12834},-1,12558.810887999998,12317.295293999998,11955.021902999999,-1,-1,-1,-1,-1,-1,-1,-1,-1,15215.482421999999,12123.627128999999,-1,-1,-1,-1,-1,-1,null,null,"Ropa CaballeroLogo corporativo (tamaño espalda)14"]
["Calzado Dama","Calzado de calle para dama.",1,4,{"$f":"ROUND(AVERAGE(IF(F222:Z222>-1,F222:Z222)),0)","v":109846},-1,-1,88394.707403999986,96485.479802999995,114719.90714999998,-1,-1,-1,-1,-1,-1,-1,-1,106266.86135999998,-1,-1,144788.59860299999,-1,92681.609197499987,125588.10887999999,-1,null,null,"Calzado DamaCalzado de calle para dama.14"]
["Calzado Dama","Calzado casual para dama.",1,4,{"$f":"ROUND(AVERAGE(IF(F223:Z223>-1,F223:Z223)),0)","v":107164},-1,-1,89119.254185999991,89964.558764999994,114719.90714999998,-1,-1,-1,-1,-1,-1,-1,-1,106266.86135999998,-1,-1,144788.59860299999,-1,90568.347750000001,114719.90714999998,-1,null,null,"Calzado DamaCalzado casual para dama.14"]
["Calzado Dama","Calzado de calle para dama clima cálido.",1,4,{"$f":"ROUND(AVERAGE(IF(F224:Z224>-1,F224:Z224)),0)","v":109106},-1,-1,89964.558764999994,96485.479802999995,114719.90714999998,-1,-1,-1,-1,-1,-1,-1,-1,106266.86135999998,-1,-1,144788.59860299999,-1,93177.171854999993,118342.64105999999,-1,null,null,"Calzado DamaCalzado de calle para dama clima cálido.14"]
["Calzado Dama","Cinturón.",1,4,{"$f":"ROUND(AVERAGE(IF(F225:Z225>-1,F225:Z225)),0)","v":40016},-1,-1,30672.480437999995,33691.425362999995,42265.228949999997,-1,-1,-1,-1,-1,-1,-1,-1,36227.339099999997,-1,-1,42144.471152999991,-1,32315.242166999997,62794.054439999993,-1,null,null,"Calzado DamaCinturón.14"]
["Calzado Caballero","Calzado de calle para caballero formal.",1,4,{"$f":"ROUND(AVERAGE(IF(F226:Z226>-1,F226:Z226)),0)","v":116048},-1,-1,98055.331163999988,99021.39353999999,-1,-1,-1,-1,-1,-1,-1,-1,-1,111097.17324,-1,-1,156864.37830299998,120154.008015,102764.885247,124380.53090999999,-1,null,null,"Calzado CaballeroCalzado de calle para caballero formal.14"]
["Calzado Caballero","Calzado deportivo para caballero",1,4,{"$f":"ROUND(AVERAGE(IF(F227:Z227>-1,F227:Z227)),0)","v":117032},-1,-1,106508.37695399998,105663.07237499999,-1,-1,-1,-1,-1,-1,-1,-1,-1,111097.17324,-1,-1,156864.37830299998,111700.96222499998,111459.44663099998,115927.48512,-1,null,null,"Calzado CaballeroCalzado deportivo para caballero14"]
["Calzado Caballero","Calzado casual para caballero.",1,4,{"$f":"ROUND(AVERAGE(IF(F228:Z228>-1,F228:Z228)),0)","v":116411},-1,-1,106508.37695399998,96485.479802999995,-1,-1,-1,-1,-1,-1,-1,-1,-1,111097.17324,-1,-1,156864.37830299998,114116.11816499999,111459.44663099998,118342.64105999999,-1,null,null,"Calzado CaballeroCalzado casual para caballero.14"]
["Calzado Caballero","Cinturón",1,4,{"$f":"ROUND(AVERAGE(IF(F229:Z229>-1,F229:Z229)),0)","v":41832},-1,-1,29223.386874,33691.425362999995,-1,-1,-1,-1,-1,-1,-1,-1,-1,36227.339099999997,-1,-1,42144.471152999991,57963.742559999999,30780.706765499996,62794.054439999993,-1,null,null,"Calzado CaballeroCinturón14"]
["Ropa Dama","Sastre formal de dos piezas para dama: chaqueta y falda o pantalón (Opción Uno).",1,5,{"$f":"ROUND(AVERAGE(IF(F230:Z230>-1,F230:Z230)),0)","v":230830},263735.02864799998,213499.78509600001,209514.77779499997,228232.23632999999,227024.65836,-1,258892.18529849997,-1,-1,-1,-1,-1,-1,-1,214912.423476,-1,-1,-1,-1,-1,-1,null,null,"Ropa DamaSastre formal de dos piezas para dama: chaqueta y falda o pantalón (Opción Uno).15"]
["Ropa Dama","Sastre formal de dos piezas para dama: chaqueta y falda o pantalón (Opción Dos).",1,5,{"$f":"ROUND(AVERAGE(IF(F231:Z231>-1,F231:Z231)),0)","v":208495},195482.94962849998,210987.79507349999,207099.621855,202873.09895999997,202873.09895999997,-1,225817.08038999999,-1,-1,-1,-1,-1,-1,-1,214332.55820549998,-1,-1,-1,-1,-1,-1,null,null,"Ropa DamaSastre formal de dos piezas para dama: chaqueta y falda o pantalón (Opción Dos).15"]
["Ropa Dama","Sastre formal de tres piezas para dama: chaqueta, chaleco y falda o pantalón.",1,5,{"$f":"ROUND(AVERAGE(IF(F232:Z232>-1,F232:Z232)),0)","v":298962},397051.63653599995,270014.43409199995,265063.36441499996,295856.60265000002,265667.15339999995,-1,332083.94175,-1,-1,-1,-1,-1,-1,-1,266995.48916699993,-1,-1,-1,-1,-1,-1,null,null,"Ropa DamaSastre formal de tres piezas para dama: chaqueta, chaleco y falda o pantalón.15"]
["Ropa Dama","Blazer para dama.",1,5,{"$f":"ROUND(AVERAGE(IF(F233:Z233>-1,F233:Z233)),0)","v":183659},179252.41817699999,194661.568764,191401.10824499998,199250.36504999999,147324.51233999999,-1,179325.32854499997,-1,-1,-1,-1,-1,-1,-1,194396.12945549999,-1,-1,-1,-1,-1,-1,null,null,"Ropa DamaBlazer para dama.15"]
["Ropa Dama","Blusa formal manga larga para dama.",1,5,{"$f":"ROUND(AVERAGE(IF(F234:Z234>-1,F234:Z234)),0)","v":71407},69267.128048999992,71023.812227999995,69435.733274999991,69435.733274999991,57963.742559999999,-1,91655.167923000001,-1,-1,-1,-1,-1,-1,-1,71065.963534499984,-1,-1,-1,-1,-1,-1,null,null,"Ropa DamaBlusa formal manga larga para dama.15"]
["Ropa Dama","Blusa formal manga corta para dama.",1,5,{"$f":"ROUND(AVERAGE(IF(F235:Z235>-1,F235:Z235)),0)","v":67822},67818.034484999996,68509.543756500003,67020.577334999994,67020.577334999994,55548.586620000002,-1,82356.817554000008,-1,-1,-1,-1,-1,-1,-1,66477.167248500002,-1,-1,-1,-1,-1,-1,null,null,"Ropa DamaBlusa formal manga corta para dama.15"]
["Ropa Dama","Blusa sport o informal para dama.",1,5,{"$f":"ROUND(AVERAGE(IF(F236:Z236>-1,F236:Z236)),0)","v":69861},81149.239583999995,67639.176238499989,67020.577334999994,65812.999364999996,57963.742559999999,-1,82356.817554000008,-1,-1,-1,-1,-1,-1,-1,67080.956233499994,-1,-1,-1,-1,-1,-1,null,null,"Ropa DamaBlusa sport o informal para dama.15"]
["Ropa Dama","Blusa para dama.",1,5,{"$f":"ROUND(AVERAGE(IF(F237:Z237>-1,F237:Z237)),0)","v":67602},60861.929687999997,72840.875305499983,71850.889215000003,70884.826839000001,57963.742559999999,-1,73058.467184999987,-1,-1,-1,-1,-1,-1,-1,65752.620466499997,-1,-1,-1,-1,-1,-1,null,null,"Ropa DamaBlusa para dama.15"]
["Ropa Dama","Chaqueta casual o sport.",1,5,{"$f":"ROUND(AVERAGE(IF(F238:Z238>-1,F238:Z238)),0)","v":125554},120130.08430049999,114284.72339099999,111700.96222499998,119550.21902999999,135248.73264,-1,162056.96357399996,-1,-1,-1,-1,-1,-1,-1,115903.56140549999,-1,-1,-1,-1,-1,-1,null,null,"Ropa DamaChaqueta casual o sport.15"]
["Ropa Dama","Chaqueta de jean",1,5,{"$f":"ROUND(AVERAGE(IF(F239:Z239>-1,F239:Z239)),0)","v":127741},173891.22767999998,113029.29799199999,138267.67756499999,107474.43932999999,123172.95294,-1,100953.51829199999,-1,-1,-1,-1,-1,-1,-1,137398.44927149999,-1,-1,-1,-1,-1,-1,null,null,"Ropa DamaChaqueta de jean15"]
["Ropa Dama","Falda",1,5,{"$f":"ROUND(AVERAGE(IF(F240:Z240>-1,F240:Z240)),0)","v":74292},92741.988096000001,69073.459883999996,68228.155304999993,67020.577334999994,60378.898499999996,-1,92983.503689999998,-1,-1,-1,-1,-1,-1,-1,69616.869970499989,-1,-1,-1,-1,-1,-1,null,null,"Ropa DamaFalda15"]
["Ropa Dama","Gabán o abrigo para dama",1,5,{"$f":"ROUND(AVERAGE(IF(F241:Z241>-1,F241:Z241)),0)","v":205530},257938.65439199997,214755.21049499998,210722.35576499999,206495.83286999998,193212.47519999999,-1,146116.93436999997,-1,-1,-1,-1,-1,-1,-1,209466.93036599999,-1,-1,-1,-1,-1,-1,null,null,"Ropa DamaGabán o abrigo para dama15"]
["Ropa Dama","Pantalón formal",1,5,{"$f":"ROUND(AVERAGE(IF(F242:Z242>-1,F242:Z242)),0)","v":86580},94191.081659999982,83417.435563499996,81511.512975000005,81994.544162999999,74869.834139999992,-1,104938.52559299998,-1,-1,-1,-1,-1,-1,-1,85134.246884999986,-1,-1,-1,-1,-1,-1,null,null,"Ropa DamaPantalón formal15"]
["Ropa Dama","Pantalón drill formal",1,5,{"$f":"ROUND(AVERAGE(IF(F243:Z243>-1,F243:Z243)),0)","v":81719},92741.988096000001,75352.865327999985,74266.045155,72333.920402999996,96606.237599999993,-1,86341.824854999999,-1,-1,-1,-1,-1,-1,-1,74386.802951999998,-1,-1,-1,-1,-1,-1,null,null,"Ropa DamaPantalón drill formal15"]
["Ropa Dama","Jean clásico",1,5,{"$f":"ROUND(AVERAGE(IF(F244:Z244>-1,F244:Z244)),0)","v":73659},94191.081659999982,60282.064417499991,59775.109514999996,58157.410724999994,96606.237599999993,-1,86341.824854999999,-1,-1,-1,-1,-1,-1,-1,60258.14070299999,-1,-1,-1,-1,-1,-1,null,null,"Ropa DamaJean clásico15"]
["Ropa Dama","Jean informal",1,5,{"$f":"ROUND(AVERAGE(IF(F245:Z245>-1,F245:Z245)),0)","v":91814},137663.88858,72840.875305499983,71850.889215000003,69918.764463,106266.86135999998,-1,112908.54019499999,-1,-1,-1,-1,-1,-1,-1,71247.100229999996,-1,-1,-1,-1,-1,-1,null,null,"Ropa DamaJean informal15"]
["Ropa Dama","Camisa tipo polo",1,5,{"$f":"ROUND(AVERAGE(IF(F246:Z246>-1,F246:Z246)),0)","v":37400},42023.713355999993,31397.027219999996,30793.238235000001,30793.238235000001,43472.806919999995,-1,51805.094912999994,-1,-1,-1,-1,-1,-1,-1,31517.785016999998,-1,-1,-1,-1,-1,-1,null,null,"Ropa DamaCamisa tipo polo15"]
["Ropa Dama","Camiseta tipo T-shirt básica",1,5,{"$f":"ROUND(AVERAGE(IF(F247:Z247>-1,F247:Z247)),0)","v":21048},19562.763114000001,16326.226309499998,16302.302594999997,15577.755812999998,28981.871279999999,-1,34403.440675499995,-1,-1,-1,-1,-1,-1,-1,16181.544797999999,-1,-1,-1,-1,-1,-1,null,null,"Ropa DamaCamiseta tipo T-shirt básica15"]
["Ropa Dama","Bata o blusa labor",1,5,{"$f":"ROUND(AVERAGE(IF(F248:Z248>-1,F248:Z248)),0)","v":42902},50718.274739999993,31397.027219999996,32000.816204999996,30068.691452999996,43472.806919999995,-1,78238.520986499992,-1,-1,-1,-1,-1,-1,-1,34415.972145,-1,-1,-1,-1,-1,-1,null,null,"Ropa DamaBata o blusa labor15"]
["Ropa Dama","Pashmina",1,5,{"$f":"ROUND(AVERAGE(IF(F249:Z249>-1,F249:Z249)),0)","v":29637},13041.842075999999,25117.621775999996,25962.926354999996,24151.559399999998,28981.871279999999,-1,61103.445281999993,-1,-1,-1,-1,-1,-1,-1,29102.629076999998,-1,-1,-1,-1,-1,-1,null,null,"Ropa DamaPashmina15"]
["Ropa Dama","Vestido",1,5,{"$f":"ROUND(AVERAGE(IF(F250:Z250>-1,F250:Z250)),0)","v":153742},105783.83017199999,163264.54154399998,160004.08102499999,158796.50305499998,156985.1361,-1,172683.64971,-1,-1,-1,-1,-1,-1,-1,158675.74525800001,-1,-1,-1,-1,-1,-1,null,null,"Ropa DamaVestido15"]
["Ropa Dama","Logo corporativo (tamaño bolsillo)",1,5,{"$f":"ROUND(AVERAGE(IF(F251:Z251>-1,F251:Z251)),0)","v":8208},9660.6237599999986,6279.4054439999991,7003.9522259999994,5917.1320530000003,12075.779699999999,-1,9032.9110604999987,-1,-1,-1,-1,-1,-1,-1,7486.9834139999994,-1,-1,-1,-1,-1,-1,null,null,"Ropa DamaLogo corporativo (tamaño bolsillo)15"]
["Ropa Dama","Logo corporativo (tamaño espalda)",1,5,{"$f":"ROUND(AVERAGE(IF(F252:Z252>-1,F252:Z252)),0)","v":14110},18113.669549999999,12935.8941975,12317.295293999998,11955.021902999999,16906.09158,-1,14346.254128499999,-1,-1,-1,-1,-1,-1,-1,12196.537496999999,-1,-1,-1,-1,-1,-1,null,null,"Ropa DamaLogo corporativo (tamaño espalda)15"]
["Ropa Caballero","Vestido formal de dos piezas para hombre: saco y pantalón (Opción uno).",1,5,{"$f":"ROUND(AVERAGE(IF(F253:Z253>-1,F253:Z253)),0)","v":256671},-1,238617.40687199999,233304.06380399998,301773.73470299999,-1,-1,-1,-1,-1,-1,-1,-1,-1,-1,236745.66101849999,272912.62121999997,-1,-1,-1,-1,-1,null,null,"Ropa CaballeroVestido formal de dos piezas para hombre: saco y pantalón (Opción uno).15"]
["Ropa Caballero","Vestido formal de dos piezas para hombre: saco y pantalón (Opción dos).",1,5,{"$f":"ROUND(AVERAGE(IF(F254:Z254>-1,F254:Z254)),0)","v":247268},-1,226058.59598399999,221228.28410399996,264459.57542999997,-1,-1,-1,-1,-1,-1,-1,-1,-1,-1,222701.30138249998,301894.49249999999,-1,-1,-1,-1,-1,null,null,"Ropa CaballeroVestido formal de dos piezas para hombre: saco y pantalón (Opción dos).15"]
["Ropa Caballero","Camisa formal manga larga (Tipo uno, recomendable clima cálido).",1,5,{"$f":"ROUND(AVERAGE(IF(F255:Z255>-1,F255:Z255)),0)","v":63881},-1,62794.054439999993,61827.992063999998,62069.507657999995,-1,-1,-1,-1,-1,-1,-1,-1,-1,-1,62673.296642999994,70039.522259999998,-1,-1,-1,-1,-1,null,null,"Ropa CaballeroCamisa formal manga larga (Tipo uno, recomendable clima cálido).15"]
["Ropa Caballero","Camisa formal manga corta (Tipo uno, recomendable clima cálido).",1,5,{"$f":"ROUND(AVERAGE(IF(F256:Z256>-1,F256:Z256)),0)","v":58582},-1,56514.648995999996,55790.102213999999,56152.375604999994,-1,-1,-1,-1,-1,-1,-1,-1,-1,-1,55621.496987999999,68831.944289999999,-1,-1,-1,-1,-1,null,null,"Ropa CaballeroCamisa formal manga corta (Tipo uno, recomendable clima cálido).15"]
["Ropa Caballero","Camisa formal manga larga para caballero (Tipo dos).",1,5,{"$f":"ROUND(AVERAGE(IF(F257:Z257>-1,F257:Z257)),0)","v":66562},-1,62794.054439999993,61827.992063999998,62190.265454999993,-1,-1,-1,-1,-1,-1,-1,-1,-1,-1,62673.296642999994,83322.879929999996,-1,-1,-1,-1,-1,null,null,"Ropa CaballeroCamisa formal manga larga para caballero (Tipo dos).15"]
["Ropa Caballero","Camisa formal manga corta para caballero (Tipo dos).",1,5,{"$f":"ROUND(AVERAGE(IF(F258:Z258>-1,F258:Z258)),0)","v":60514},-1,56514.648995999996,55790.102213999999,56152.375604999994,-1,-1,-1,-1,-1,-1,-1,-1,-1,-1,55621.496987999999,78492.568050000002,-1,-1,-1,-1,-1,null,null,{"$f":"A258&B258&C258&D258","v":"Ropa CaballeroCamisa formal manga corta para caballero (Tipo dos).15"}]
["Ropa Caballero","Corbata",1,5,{"$f":"ROUND(AVERAGE(IF(F259:Z259>-1,F259:Z259)),0)","v":25265},-1,18838.216331999996,18355.185143999999,22823.223632999998,-1,-1,-1,-1,-1,-1,-1,-1,-1,-1,25250.911042499996,41057.650979999991,-1,-1,-1,-1,-1,null,null,"Ropa CaballeroCorbata15"]
["Ropa Caballero","Chaqueta casual o sport.",1,5,{"$f":"ROUND(AVERAGE(IF(F260:Z260>-1,F260:Z260)),0)","v":113797},-1,96703.071682499984,95640.175223999991,107957.47051799999,-1,-1,-1,-1,-1,-1,-1,-1,-1,-1,97210.026584999985,171476.07173999998,-1,-1,-1,-1,-1,null,null,"Ropa CaballeroChaqueta casual o sport.15"]
["Ropa Caballero","Chaqueta de jean",1,5,{"$f":"ROUND(AVERAGE(IF(F261:Z261>-1,F261:Z261)),0)","v":121596},-1,109261.88257049999,111338.688834,107353.68153299998,-1,-1,-1,-1,-1,-1,-1,-1,-1,-1,110963.88397349999,169060.91579999999,-1,-1,-1,-1,-1,null,null,"Ropa CaballeroChaqueta de jean15"]
["Ropa Caballero","Chaqueta de drill",1,5,{"$f":"ROUND(AVERAGE(IF(F262:Z262>-1,F262:Z262)),0)","v":120499},-1,113029.29799199999,106508.37695399998,107353.68153299998,-1,-1,-1,-1,-1,-1,-1,-1,-1,-1,107752.41010799998,167853.33783,-1,-1,-1,-1,-1,null,null,"Ropa CaballeroChaqueta de drill15"]
["Ropa Caballero","Blazer para hombre.",1,5,{"$f":"ROUND(AVERAGE(IF(F263:Z263>-1,F263:Z263)),0)","v":185508},-1,169543.94698800001,166887.27545399999,216156.45663,-1,-1,-1,-1,-1,-1,-1,-1,-1,-1,170872.28275499999,204080.67692999999,-1,-1,-1,-1,-1,null,null,"Ropa CaballeroBlazer para hombre.15"]
["Ropa Caballero","Camisa sport o informal",1,5,{"$f":"ROUND(AVERAGE(IF(F264:Z264>-1,F264:Z264)),0)","v":65453},-1,62794.054439999993,61827.992063999998,61465.718672999988,-1,-1,-1,-1,-1,-1,-1,-1,-1,-1,62685.828112499992,78492.568050000002,-1,-1,-1,-1,-1,null,null,"Ropa CaballeroCamisa sport o informal15"]
["Ropa Caballero","Camiseta tipo t-shirt blanca",1,5,{"$f":"ROUND(AVERAGE(IF(F265:Z265>-1,F265:Z265)),0)","v":17718},-1,11303.385488999998,12317.295293999998,11471.990714999998,-1,-1,-1,-1,-1,-1,-1,-1,-1,-1,12438.053091,41057.650979999991,-1,-1,-1,-1,-1,null,null,"Ropa CaballeroCamiseta tipo t-shirt blanca15"]
["Ropa Caballero","Camiseta tipo t-shirt estampada",1,5,{"$f":"ROUND(AVERAGE(IF(F266:Z266>-1,F266:Z266)),0)","v":23185},-1,15070.8009105,14732.451233999998,20408.067692999997,-1,-1,-1,-1,-1,-1,-1,-1,-1,-1,14997.890542499999,50718.274739999993,-1,-1,-1,-1,-1,null,null,"Ropa CaballeroCamiseta tipo t-shirt estampada15"]
["Ropa Caballero","Camisa tipo polo",1,5,{"$f":"ROUND(AVERAGE(IF(F267:Z267>-1,F267:Z267)),0)","v":35213},-1,31397.027219999996,30430.964843999998,30793.238235000001,-1,-1,-1,-1,-1,-1,-1,-1,-1,-1,30310.207047,53133.43067999999,-1,-1,-1,-1,-1,null,null,"Ropa CaballeroCamisa tipo polo15"]
["Ropa Caballero","Pantalón de dril formal",1,5,{"$f":"ROUND(AVERAGE(IF(F268:Z268>-1,F268:Z268)),0)","v":72503},-1,69073.459883999996,67865.881913999998,66296.03055299999,-1,-1,-1,-1,-1,-1,-1,-1,-1,-1,69918.764463,89360.769779999988,-1,-1,-1,-1,-1,null,null,"Ropa CaballeroPantalón de dril formal15"]
["Ropa Caballero","Jean clásico",1,5,{"$f":"ROUND(AVERAGE(IF(F269:Z269>-1,F269:Z269)),0)","v":60971},-1,56514.648995999996,55790.102213999999,54220.25085299999,-1,-1,-1,-1,-1,-1,-1,-1,-1,-1,55005.176533499995,83322.879929999996,-1,-1,-1,-1,-1,null,null,"Ropa CaballeroJean clásico15"]
["Ropa Caballero","Jean informal",1,5,{"$f":"ROUND(AVERAGE(IF(F270:Z270>-1,F270:Z270)),0)","v":69834},-1,62794.054439999993,61827.992063999998,60258.14070299999,-1,-1,-1,-1,-1,-1,-1,-1,-1,-1,62854.433338499992,101436.54947999999,-1,-1,-1,-1,-1,null,null,"Ropa CaballeroJean informal15"]
["Ropa Caballero","Bata o blusa labor",1,5,{"$f":"ROUND(AVERAGE(IF(F271:Z271>-1,F271:Z271)),0)","v":30136},-1,11931.098188499998,31638.542813999997,31276.269422999998,-1,-1,-1,-1,-1,-1,-1,-1,-1,-1,34778.245535999995,41057.650979999991,-1,-1,-1,-1,-1,null,null,"Ropa CaballeroBata o blusa labor15"]
["Ropa Caballero","Calcetín para calzado calle",1,5,{"$f":"ROUND(AVERAGE(IF(F272:Z272>-1,F272:Z272)),0)","v":11820},-1,11303.385488999998,11109.717323999999,10868.201729999999,-1,-1,-1,-1,-1,-1,-1,-1,-1,-1,11327.309203499999,14490.93564,-1,-1,-1,-1,-1,null,null,"Ropa CaballeroCalcetín para calzado calle15"]
["Ropa Caballero","Calcetín para calzado deportivo",1,5,{"$f":"ROUND(AVERAGE(IF(F273:Z273>-1,F273:Z273)),0)","v":12525},-1,11931.098188499998,11109.717323999999,11351.232918,-1,-1,-1,-1,-1,-1,-1,-1,-1,-1,11327.309203499999,16906.09158,-1,-1,-1,-1,-1,null,null,"Ropa CaballeroCalcetín para calzado deportivo15"]
["Ropa Caballero","Pantaloncillo tipo bóxer.",1,5,{"$f":"ROUND(AVERAGE(IF(F274:Z274>-1,F274:Z274)),0)","v":18118},-1,31397.027219999996,12317.295293999998,15577.755812999998,-1,-1,-1,-1,-1,-1,-1,-1,-1,-1,11978.9456175,19321.247519999997,-1,-1,-1,-1,-1,null,null,"Ropa CaballeroPantaloncillo tipo bóxer.15"]
["Ropa Caballero","Gorra o cachucha",1,5,{"$f":"ROUND(AVERAGE(IF(F275:Z275>-1,F275:Z275)),0)","v":21553},-1,18838.216331999996,19562.763114000001,22823.223632999998,-1,-1,-1,-1,-1,-1,-1,-1,-1,-1,19972.883933999998,26566.715339999995,-1,-1,-1,-1,-1,null,null,"Ropa CaballeroGorra o cachucha15"]
["Ropa Caballero","Tula / Morral",1,5,{"$f":"ROUND(AVERAGE(IF(F276:Z276>-1,F276:Z276)),0)","v":78379},-1,71585.449906499998,70281.037853999995,70039.522259999998,-1,-1,-1,-1,-1,-1,-1,-1,-1,-1,72515.057098499994,107474.43932999999,-1,-1,-1,-1,-1,null,null,"Ropa CaballeroTula / Morral15"]
["Ropa Caballero","Logo corporativo (tamaño bolsillo)",1,5,{"$f":"ROUND(AVERAGE(IF(F277:Z277>-1,F277:Z277)),0)","v":9627},-1,6279.4054439999991,7003.9522259999994,5917.1320530000003,-1,-1,-1,-1,-1,-1,-1,-1,-1,-1,7197.6203909999995,21736.403459999998,-1,-1,-1,-1,-1,null,null,"Ropa CaballeroLogo corporativo (tamaño bolsillo)15"]
["Ropa Caballero","Logo corporativo (tamaño espalda)",1,5,{"$f":"ROUND(AVERAGE(IF(F278:Z278>-1,F278:Z278)),0)","v":15829},-1,12558.810887999998,12317.295293999998,11955.021902999999,-1,-1,-1,-1,-1,-1,-1,-1,-1,-1,12123.627128999999,30189.449249999998,-1,-1,-1,-1,-1,null,null,"Ropa CaballeroLogo corporativo (tamaño espalda)15"]
["Calzado Dama","Calzado de calle para dama.",1,5,{"$f":"ROUND(AVERAGE(IF(F279:Z279>-1,F279:Z279)),0)","v":106394},-1,90423.666238499995,88394.707403999986,96485.479802999995,-1,-1,-1,-1,-1,-1,-1,-1,-1,-1,-1,-1,144788.59860299999,-1,92681.609197499987,125588.10887999999,-1,null,null,"Calzado DamaCalzado de calle para dama.15"]
["Calzado Dama","Calzado casual para dama.",1,5,{"$f":"ROUND(AVERAGE(IF(F280:Z280>-1,F280:Z280)),0)","v":103264},-1,90423.666238499995,89119.254185999991,89964.558764999994,-1,-1,-1,-1,-1,-1,-1,-1,-1,-1,-1,-1,144788.59860299999,-1,90568.347750000001,114719.90714999998,-1,null,null,"Calzado DamaCalzado casual para dama.15"]
["Calzado Dama","Calzado de calle para dama clima cálido.",1,5,{"$f":"ROUND(AVERAGE(IF(F281:Z281>-1,F281:Z281)),0)","v":105949},-1,92935.656260999996,89964.558764999994,96485.479802999995,-1,-1,-1,-1,-1,-1,-1,-1,-1,-1,-1,-1,144788.59860299999,-1,93177.171854999993,118342.64105999999,-1,null,null,"Calzado DamaCalzado de calle para dama clima cálido.15"]
["Calzado Dama","Cinturón.",1,5,{"$f":"ROUND(AVERAGE(IF(F282:Z282>-1,F282:Z282)),0)","v":38836},-1,31397.027219999996,30672.480437999995,33691.425362999995,-1,-1,-1,-1,-1,-1,-1,-1,-1,-1,-1,-1,42144.471152999991,-1,32315.242166999997,62794.054439999993,-1,null,null,"Calzado DamaCinturón.15"]
["Calzado Caballero","Calzado de calle para caballero formal.",1,5,{"$f":"ROUND(AVERAGE(IF(F283:Z283>-1,F283:Z283)),0)","v":113593},-1,100470.48710399999,98055.331163999988,99021.39353999999,-1,-1,-1,-1,-1,-1,-1,-1,-1,-1,-1,-1,156864.37830299998,-1,102764.885247,124380.53090999999,-1,null,null,"Calzado CaballeroCalzado de calle para caballero formal.15"]
["Calzado Caballero","Calzado deportivo para caballero",1,5,{"$f":"ROUND(AVERAGE(IF(F284:Z284>-1,F284:Z284)),0)","v":117614},-1,109261.88257049999,106508.37695399998,105663.07237499999,-1,-1,-1,-1,-1,-1,-1,-1,-1,-1,-1,-1,156864.37830299998,-1,111459.44663099998,115927.48512,-1,null,null,"Calzado CaballeroCalzado deportivo para caballero15"]
["Calzado Caballero","Calzado casual para caballero.",1,5,{"$f":"ROUND(AVERAGE(IF(F285:Z285>-1,F285:Z285)),0)","v":116487},-1,109261.88257049999,106508.37695399998,96485.479802999995,-1,-1,-1,-1,-1,-1,-1,-1,-1,-1,-1,-1,156864.37830299998,-1,111459.44663099998,118342.64105999999,-1,null,null,"Calzado CaballeroCalzado casual para caballero.15"]
["Calzado Caballero","Cinturón",1,5,{"$f":"ROUND(AVERAGE(IF(F286:Z286>-1,F286:Z286)),0)","v":38129},-1,30141.601821,29223.386874,33691.425362999995,-1,-1,-1,-1,-1,-1,-1,-1,-1,-1,-1,-1,42144.471152999991,-1,30780.706765499996,62794.054439999993,-1,null,null,"Calzado CaballeroCinturón15"]
["Ropa Dama","Sastre formal de dos piezas para dama: chaqueta y falda o pantalón (Opción Uno).",1,6,{"$f":"ROUND(AVERAGE(IF(F287:Z287>-1,F287:Z287)),0)","v":221189},219779.19053999998,213499.78509600001,209514.77779499997,228232.23632999999,227024.65836,-1,235356.94635299998,-1,-1,-1,-1,-1,-1,-1,214912.423476,-1,-1,-1,-1,-1,-1,null,null,"Ropa DamaSastre formal de dos piezas para dama: chaqueta y falda o pantalón (Opción Uno).16"]
["Ropa Dama","Sastre formal de dos piezas para dama: chaqueta y falda o pantalón (Opción Dos).",1,6,{"$f":"ROUND(AVERAGE(IF(F288:Z288>-1,F288:Z288)),0)","v":200908},162902.26815299998,210987.79507349999,207099.621855,202873.09895999997,202873.09895999997,-1,205288.2549,-1,-1,-1,-1,-1,-1,-1,214332.55820549998,-1,-1,-1,-1,-1,-1,null,null,"Ropa DamaSastre formal de dos piezas para dama: chaqueta y falda o pantalón (Opción Dos).16"]
["Ropa Dama","Sastre formal de tres piezas para dama: chaqueta, chaleco y falda o pantalón.",1,6,{"$f":"ROUND(AVERAGE(IF(F289:Z289>-1,F289:Z289)),0)","v":285195},330876.36377999996,270014.43409199995,265063.36441499996,295856.60265000002,265667.15339999995,-1,301894.49249999999,-1,-1,-1,-1,-1,-1,-1,266995.48916699993,-1,-1,-1,-1,-1,-1,null,null,"Ropa DamaSastre formal de tres piezas para dama: chaqueta, chaleco y falda o pantalón.16"]
["Ropa Dama","Blazer para dama.",1,6,{"$f":"ROUND(AVERAGE(IF(F290:Z290>-1,F290:Z290)),0)","v":177062},149377.39488899999,194661.568764,191401.10824499998,199250.36504999999,147324.51233999999,-1,163023.02595000001,-1,-1,-1,-1,-1,-1,-1,194396.12945549999,-1,-1,-1,-1,-1,-1,null,null,"Ropa DamaBlazer para dama.16"]
["Ropa Dama","Blusa formal manga larga para dama.",1,6,{"$f":"ROUND(AVERAGE(IF(F291:Z291>-1,F291:Z291)),0)","v":68567},57722.226965999995,71023.812227999995,69435.733274999991,69435.733274999991,57963.742559999999,-1,83322.879929999996,-1,-1,-1,-1,-1,-1,-1,71065.963534499984,-1,-1,-1,-1,-1,-1,null,null,"Ropa DamaBlusa formal manga larga para dama.16"]
["Ropa Dama","Blusa formal manga corta para dama.",1,6,{"$f":"ROUND(AVERAGE(IF(F292:Z292>-1,F292:Z292)),0)","v":65137},56514.648995999996,68509.543756500003,67020.577334999994,67020.577334999994,55548.586620000002,-1,74869.834139999992,-1,-1,-1,-1,-1,-1,-1,66477.167248500002,-1,-1,-1,-1,-1,-1,null,null,"Ropa DamaBlusa formal manga corta para dama.16"]
["Ropa Dama","Blusa sport o informal para dama.",1,6,{"$f":"ROUND(AVERAGE(IF(F293:Z293>-1,F293:Z293)),0)","v":66859},67624.366320000001,67639.176238499989,67020.577334999994,65812.999364999996,57963.742559999999,-1,74869.834139999992,-1,-1,-1,-1,-1,-1,-1,67080.956233499994,-1,-1,-1,-1,-1,-1,null,null,"Ropa DamaBlusa sport o informal para dama.16"]
["Ropa Dama","Blusa para dama.",1,6,{"$f":"ROUND(AVERAGE(IF(F294:Z294>-1,F294:Z294)),0)","v":65204},50718.274739999993,72840.875305499983,71850.889215000003,70884.826839000001,57963.742559999999,-1,66416.788349999988,-1,-1,-1,-1,-1,-1,-1,65752.620466499997,-1,-1,-1,-1,-1,-1,null,null,"Ropa DamaBlusa para dama.16"]
["Ropa Dama","Chaqueta casual o sport.",1,6,{"$f":"ROUND(AVERAGE(IF(F295:Z295>-1,F295:Z295)),0)","v":120589},100108.21371299999,114284.72339099999,111700.96222499998,119550.21902999999,135248.73264,-1,147324.51233999999,-1,-1,-1,-1,-1,-1,-1,115903.56140549999,-1,-1,-1,-1,-1,-1,null,null,"Ropa DamaChaqueta casual o sport.16"]
["Ropa Dama","Chaqueta de jean",1,6,{"$f":"ROUND(AVERAGE(IF(F296:Z296>-1,F296:Z296)),0)","v":122290},144909.35639999999,113029.29799199999,138267.67756499999,107474.43932999999,123172.95294,-1,91775.925719999985,-1,-1,-1,-1,-1,-1,-1,137398.44927149999,-1,-1,-1,-1,-1,-1,null,null,"Ropa DamaChaqueta de jean16"]
["Ropa Dama","Falda",1,6,{"$f":"ROUND(AVERAGE(IF(F297:Z297>-1,F297:Z297)),0)","v":70876},77284.990079999989,69073.459883999996,68228.155304999993,67020.577334999994,60378.898499999996,-1,84530.457899999994,-1,-1,-1,-1,-1,-1,-1,69616.869970499989,-1,-1,-1,-1,-1,-1,null,null,"Ropa DamaFalda16"]
["Ropa Dama","Gabán o abrigo para dama",1,6,{"$f":"ROUND(AVERAGE(IF(F298:Z298>-1,F298:Z298)),0)","v":197491},214948.87865999999,214755.21049499998,210722.35576499999,206495.83286999998,193212.47519999999,-1,132833.57669999998,-1,-1,-1,-1,-1,-1,-1,209466.93036599999,-1,-1,-1,-1,-1,-1,null,null,"Ropa DamaGabán o abrigo para dama16"]
["Ropa Dama","Pantalón formal",1,6,{"$f":"ROUND(AVERAGE(IF(F299:Z299>-1,F299:Z299)),0)","v":82974},78492.568050000002,83417.435563499996,81511.512975000005,81994.544162999999,74869.834139999992,-1,95398.659629999995,-1,-1,-1,-1,-1,-1,-1,85134.246884999986,-1,-1,-1,-1,-1,-1,null,null,"Ropa DamaPantalón formal16"]
["Ropa Dama","Pantalón drill formal",1,6,{"$f":"ROUND(AVERAGE(IF(F300:Z300>-1,F300:Z300)),0)","v":78389},77284.990079999989,75352.865327999985,74266.045155,72333.920402999996,96606.237599999993,-1,78492.568050000002,-1,-1,-1,-1,-1,-1,-1,74386.802951999998,-1,-1,-1,-1,-1,-1,null,null,"Ropa DamaPantalón drill formal16"]
["Ropa Dama","Jean clásico",1,6,{"$f":"ROUND(AVERAGE(IF(F301:Z301>-1,F301:Z301)),0)","v":70295},78492.568050000002,60282.064417499991,59775.109514999996,58157.410724999994,96606.237599999993,-1,78492.568050000002,-1,-1,-1,-1,-1,-1,-1,60258.14070299999,-1,-1,-1,-1,-1,-1,null,null,"Ropa DamaJean clásico16"]
["Ropa Dama","Jean informal",1,6,{"$f":"ROUND(AVERAGE(IF(F302:Z302>-1,F302:Z302)),0)","v":87070},114719.90714999998,72840.875305499983,71850.889215000003,69918.764463,106266.86135999998,-1,102644.12745,-1,-1,-1,-1,-1,-1,-1,71247.100229999996,-1,-1,-1,-1,-1,-1,null,null,"Ropa DamaJean informal16"]
["Ropa Dama","Camisa tipo polo",1,6,{"$f":"ROUND(AVERAGE(IF(F303:Z303>-1,F303:Z303)),0)","v":35727},35019.761129999999,31397.027219999996,30793.238235000001,30793.238235000001,43472.806919999995,-1,47095.540829999991,-1,-1,-1,-1,-1,-1,-1,31517.785016999998,-1,-1,-1,-1,-1,-1,null,null,"Ropa DamaCamisa tipo polo16"]
["Ropa Dama","Camiseta tipo T-shirt básica",1,6,{"$f":"ROUND(AVERAGE(IF(F304:Z304>-1,F304:Z304)),0)","v":20135},16302.302594999997,16326.226309499998,16302.302594999997,15577.755812999998,28981.871279999999,-1,31276.269422999998,-1,-1,-1,-1,-1,-1,-1,16181.544797999999,-1,-1,-1,-1,-1,-1,null,null,"Ropa DamaCamiseta tipo T-shirt básica16"]
["Ropa Dama","Bata o blusa labor",1,6,{"$f":"ROUND(AVERAGE(IF(F305:Z305>-1,F305:Z305)),0)","v":40678},42265.228949999997,31397.027219999996,32000.816204999996,30068.691452999996,43472.806919999995,-1,71126.342432999998,-1,-1,-1,-1,-1,-1,-1,34415.972145,-1,-1,-1,-1,-1,-1,null,null,"Ropa DamaBata o blusa labor16"]
["Ropa Dama","Pashmina",1,6,{"$f":"ROUND(AVERAGE(IF(F306:Z306>-1,F306:Z306)),0)","v":28533},10868.201729999999,25117.621775999996,25962.926354999996,24151.559399999998,28981.871279999999,-1,55548.586620000002,-1,-1,-1,-1,-1,-1,-1,29102.629076999998,-1,-1,-1,-1,-1,-1,null,null,"Ropa DamaPashmina16"]
["Ropa Dama","Vestido",1,6,{"$f":"ROUND(AVERAGE(IF(F307:Z307>-1,F307:Z307)),0)","v":148981},88153.191809999989,163264.54154399998,160004.08102499999,158796.50305499998,156985.1361,-1,156985.1361,-1,-1,-1,-1,-1,-1,-1,158675.74525800001,-1,-1,-1,-1,-1,-1,null,null,"Ropa DamaVestido16"]
["Ropa Dama","Logo corporativo (tamaño bolsillo)",1,6,{"$f":"ROUND(AVERAGE(IF(F308:Z308>-1,F308:Z308)),0)","v":7401},4830.3118799999993,6279.4054439999991,7003.9522259999994,5917.1320530000003,12075.779699999999,-1,8211.5301959999997,-1,-1,-1,-1,-1,-1,-1,7486.9834139999994,-1,-1,-1,-1,-1,-1,null,null,"Ropa DamaLogo corporativo (tamaño bolsillo)16"]
["Ropa Dama","Logo corporativo (tamaño espalda)",1,6,{"$f":"ROUND(AVERAGE(IF(F309:Z309>-1,F309:Z309)),0)","v":12889},10868.201729999999,12935.8941975,12317.295293999998,11955.021902999999,16906.09158,-1,13041.842075999999,-1,-1,-1,-1,-1,-1,-1,12196.537496999999,-1,-1,-1,-1,-1,-1,null,null,"Ropa DamaLogo corporativo (tamaño espalda)16"]
["Ropa Caballero","Vestido formal de dos piezas para hombre: saco y pantalón (Opción uno).",1,6,{"$f":"ROUND(AVERAGE(IF(F310:Z310>-1,F310:Z310)),0)","v":279904},-1,238617.40687199999,233304.06380399998,301773.73470299999,-1,-1,-1,-1,-1,-1,-1,-1,-1,389081.621934,236745.66101849999,-1,-1,-1,-1,-1,-1,null,null,"Ropa CaballeroVestido formal de dos piezas para hombre: saco y pantalón (Opción uno).16"]
["Ropa Caballero","Vestido formal de dos piezas para hombre: saco y pantalón (Opción dos).",1,6,{"$f":"ROUND(AVERAGE(IF(F311:Z311>-1,F311:Z311)),0)","v":256881},-1,226058.59598399999,221228.28410399996,264459.57542999997,-1,-1,-1,-1,-1,-1,-1,-1,-1,349956.09570599993,222701.30138249998,-1,-1,-1,-1,-1,-1,null,null,"Ropa CaballeroVestido formal de dos piezas para hombre: saco y pantalón (Opción dos).16"]
["Ropa Caballero","Camisa formal manga larga (Tipo uno, recomendable clima cálido).",1,6,{"$f":"ROUND(AVERAGE(IF(F312:Z312>-1,F312:Z312)),0)","v":67045},-1,62794.054439999993,61827.992063999998,62069.507657999995,-1,-1,-1,-1,-1,-1,-1,-1,-1,85858.793666999991,62673.296642999994,-1,-1,-1,-1,-1,-1,null,null,"Ropa CaballeroCamisa formal manga larga (Tipo uno, recomendable clima cálido).16"]
["Ropa Caballero","Camisa formal manga corta (Tipo uno, recomendable clima cálido).",1,6,{"$f":"ROUND(AVERAGE(IF(F313:Z313>-1,F313:Z313)),0)","v":61118},-1,56514.648995999996,55790.102213999999,56152.375604999994,-1,-1,-1,-1,-1,-1,-1,-1,-1,81511.512975000005,55621.496987999999,-1,-1,-1,-1,-1,-1,null,null,"Ropa CaballeroCamisa formal manga corta (Tipo uno, recomendable clima cálido).16"]
["Ropa Caballero","Camisa formal manga larga para caballero (Tipo dos).",1,6,{"$f":"ROUND(AVERAGE(IF(F314:Z314>-1,F314:Z314)),0)","v":69025},-1,62794.054439999993,61827.992063999998,62190.265454999993,-1,-1,-1,-1,-1,-1,-1,-1,-1,95640.175223999991,62673.296642999994,-1,-1,-1,-1,-1,-1,null,null,"Ropa CaballeroCamisa formal manga larga para caballero (Tipo dos).16"]
["Ropa Caballero","Camisa formal manga corta para caballero (Tipo dos).",1,6,{"$f":"ROUND(AVERAGE(IF(F315:Z315>-1,F315:Z315)),0)","v":62640},-1,56514.648995999996,55790.102213999999,56152.375604999994,-1,-1,-1,-1,-1,-1,-1,-1,-1,89119.254185999991,55621.496987999999,-1,-1,-1,-1,-1,-1,null,null,"Ropa CaballeroCamisa formal manga corta para caballero (Tipo dos).16"]
["Ropa Caballero","Corbata",1,6,{"$f":"ROUND(AVERAGE(IF(F316:Z316>-1,F316:Z316)),0)","v":24879},-1,18838.216331999996,18355.185143999999,22823.223632999998,-1,-1,-1,-1,-1,-1,-1,-1,-1,39125.526228000002,25250.911042499996,-1,-1,-1,-1,-1,-1,null,null,"Ropa CaballeroCorbata16"]
["Ropa Caballero","Chaqueta casual o sport.",1,6,{"$f":"ROUND(AVERAGE(IF(F317:Z317>-1,F317:Z317)),0)","v":114715},-1,96703.071682499984,95640.175223999991,107957.47051799999,-1,-1,-1,-1,-1,-1,-1,-1,-1,176064.86802599998,97210.026584999985,-1,-1,-1,-1,-1,-1,null,null,"Ropa CaballeroChaqueta casual o sport.16"]
["Ropa Caballero","Chaqueta de jean",1,6,{"$f":"ROUND(AVERAGE(IF(F318:Z318>-1,F318:Z318)),0)","v":118215},-1,109261.88257049999,111338.688834,107353.68153299998,-1,-1,-1,-1,-1,-1,-1,-1,-1,152154.82421999998,110963.88397349999,-1,-1,-1,-1,-1,-1,null,null,"Ropa CaballeroChaqueta de jean16"]
["Ropa Caballero","Chaqueta de drill",1,6,{"$f":"ROUND(AVERAGE(IF(F319:Z319>-1,F319:Z319)),0)","v":117360},-1,113029.29799199999,106508.37695399998,107353.68153299998,-1,-1,-1,-1,-1,-1,-1,-1,-1,152154.82421999998,107752.41010799998,-1,-1,-1,-1,-1,-1,null,null,"Ropa CaballeroChaqueta de drill16"]
["Ropa Caballero","Blazer para hombre.",1,6,{"$f":"ROUND(AVERAGE(IF(F320:Z320>-1,F320:Z320)),0)","v":183818},-1,169543.94698800001,166887.27545399999,216156.45663,-1,-1,-1,-1,-1,-1,-1,-1,-1,195627.63113999998,170872.28275499999,-1,-1,-1,-1,-1,-1,null,null,"Ropa CaballeroBlazer para hombre.16"]
["Ropa Caballero","Camisa sport o informal",1,6,{"$f":"ROUND(AVERAGE(IF(F321:Z321>-1,F321:Z321)),0)","v":63666},-1,62794.054439999993,61827.992063999998,61465.718672999988,-1,-1,-1,-1,-1,-1,-1,-1,-1,69556.49107199999,62685.828112499992,-1,-1,-1,-1,-1,-1,null,null,"Ropa CaballeroCamisa sport o informal16"]
["Ropa Caballero","Camiseta tipo t-shirt blanca",1,6,{"$f":"ROUND(AVERAGE(IF(F322:Z322>-1,F322:Z322)),0)","v":16897},-1,11303.385488999998,12317.295293999998,11471.990714999998,-1,-1,-1,-1,-1,-1,-1,-1,-1,36951.885881999995,12438.053091,-1,-1,-1,-1,-1,-1,null,null,{"$f":"A322&B322&C322&D322","v":"Ropa CaballeroCamiseta tipo t-shirt blanca16"}]
["Ropa Caballero","Camiseta tipo t-shirt estampada",1,6,{"$f":"ROUND(AVERAGE(IF(F323:Z323>-1,F323:Z323)),0)","v":20867},-1,15070.8009105,14732.451233999998,20408.067692999997,-1,-1,-1,-1,-1,-1,-1,-1,-1,39125.526228000002,14997.890542499999,-1,-1,-1,-1,-1,-1,null,null,"Ropa CaballeroCamiseta tipo t-shirt estampada16"]
["Ropa Caballero","Camisa tipo polo",1,6,{"$f":"ROUND(AVERAGE(IF(F324:Z324>-1,F324:Z324)),0)","v":34150},-1,31397.027219999996,30430.964843999998,30793.238235000001,-1,-1,-1,-1,-1,-1,-1,-1,-1,47820.087611999996,30310.207047,-1,-1,-1,-1,-1,-1,null,null,"Ropa CaballeroCamisa tipo polo16"]
["Ropa Caballero","Pantalón de dril formal",1,6,{"$f":"ROUND(AVERAGE(IF(F325:Z325>-1,F325:Z325)),0)","v":72889},-1,69073.459883999996,67865.881913999998,66296.03055299999,-1,-1,-1,-1,-1,-1,-1,-1,-1,91292.894531999991,69918.764463,-1,-1,-1,-1,-1,-1,null,null,"Ropa CaballeroPantalón de dril formal16"]
["Ropa Caballero","Jean clásico",1,6,{"$f":"ROUND(AVERAGE(IF(F326:Z326>-1,F326:Z326)),0)","v":62130},-1,56514.648995999996,55790.102213999999,54220.25085299999,-1,-1,-1,-1,-1,-1,-1,-1,-1,89119.254185999991,55005.176533499995,-1,-1,-1,-1,-1,-1,null,null,"Ropa CaballeroJean clásico16"]
["Ropa Caballero","Jean informal",1,6,{"$f":"ROUND(AVERAGE(IF(F327:Z327>-1,F327:Z327)),0)","v":69979},-1,62794.054439999993,61827.992063999998,60258.14070299999,-1,-1,-1,-1,-1,-1,-1,-1,-1,102161.09626199999,62854.433338499992,-1,-1,-1,-1,-1,-1,null,null,"Ropa CaballeroJean informal16"]
["Ropa Caballero","Bata o blusa labor",1,6,{"$f":"ROUND(AVERAGE(IF(F328:Z328>-1,F328:Z328)),0)","v":30185},-1,11931.098188499998,31638.542813999997,31276.269422999998,-1,-1,-1,-1,-1,-1,-1,-1,-1,41299.166574000003,34778.245535999995,-1,-1,-1,-1,-1,-1,null,null,"Ropa CaballeroBata o blusa labor16"]
["Ropa Caballero","Calcetín para calzado calle",1,6,{"$f":"ROUND(AVERAGE(IF(F329:Z329>-1,F329:Z329)),0)","v":12400},-1,11303.385488999998,11109.717323999999,10868.201729999999,-1,-1,-1,-1,-1,-1,-1,-1,-1,17389.122767999997,11327.309203499999,-1,-1,-1,-1,-1,-1,null,null,"Ropa CaballeroCalcetín para calzado calle16"]
["Ropa Caballero","Calcetín para calzado deportivo",1,6,{"$f":"ROUND(AVERAGE(IF(F330:Z330>-1,F330:Z330)),0)","v":12622},-1,11931.098188499998,11109.717323999999,11351.232918,-1,-1,-1,-1,-1,-1,-1,-1,-1,17389.122767999997,11327.309203499999,-1,-1,-1,-1,-1,-1,null,null,"Ropa CaballeroCalcetín para calzado deportivo16"]
["Ropa Caballero","Pantaloncillo tipo bóxer.",1,6,{"$f":"ROUND(AVERAGE(IF(F331:Z331>-1,F331:Z331)),0)","v":19906},-1,31397.027219999996,12317.295293999998,15577.755812999998,-1,-1,-1,-1,-1,-1,-1,-1,-1,28257.324497999998,11978.9456175,-1,-1,-1,-1,-1,-1,null,null,"Ropa CaballeroPantaloncillo tipo bóxer.16"]
["Ropa Caballero","Gorra o cachucha",1,6,{"$f":"ROUND(AVERAGE(IF(F332:Z332>-1,F332:Z332)),0)","v":20152},-1,18838.216331999996,19562.763114000001,22823.223632999998,-1,-1,-1,-1,-1,-1,-1,-1,-1,19562.763114000001,19972.883933999998,-1,-1,-1,-1,-1,-1,null,null,"Ropa CaballeroGorra o cachucha16"]
["Ropa Caballero","Tula / Morral",1,6,{"$f":"ROUND(AVERAGE(IF(F333:Z333>-1,F333:Z333)),0)","v":76012},-1,71585.449906499998,70281.037853999995,70039.522259999998,-1,-1,-1,-1,-1,-1,-1,-1,-1,95640.175223999991,72515.057098499994,-1,-1,-1,-1,-1,-1,null,null,"Ropa CaballeroTula / Morral16"]
["Ropa Caballero","Logo corporativo (tamaño bolsillo)",1,6,{"$f":"ROUND(AVERAGE(IF(F334:Z334>-1,F334:Z334)),0)","v":7019},-1,6279.4054439999991,7003.9522259999994,5917.1320530000003,-1,-1,-1,-1,-1,-1,-1,-1,-1,8694.5613839999987,7197.6203909999995,-1,-1,-1,-1,-1,-1,null,null,"Ropa CaballeroLogo corporativo (tamaño bolsillo)16"]
["Ropa Caballero","Logo corporativo (tamaño espalda)",1,6,{"$f":"ROUND(AVERAGE(IF(F335:Z335>-1,F335:Z335)),0)","v":12834},-1,12558.810887999998,12317.295293999998,11955.021902999999,-1,-1,-1,-1,-1,-1,-1,-1,-1,15215.482421999999,12123.627128999999,-1,-1,-1,-1,-1,-1,null,null,"Ropa CaballeroLogo corporativo (tamaño espalda)16"]
["Calzado Dama","Calzado de calle para dama.",1,6,{"$f":"ROUND(AVERAGE(IF(F336:Z336>-1,F336:Z336)),0)","v":114093},-1,-1,88394.707403999986,-1,114719.90714999998,-1,-1,-1,-1,-1,-1,-1,-1,106266.86135999998,-1,-1,144788.59860299999,121361.58598499998,90870.242242499997,125588.10887999999,120757.79699999999,null,null,"Calzado DamaCalzado de calle para dama.16"]
["Calzado Dama","Calzado casual para dama.",1,6,{"$f":"ROUND(AVERAGE(IF(F337:Z337>-1,F337:Z337)),0)","v":112264},-1,-1,89119.254185999991,-1,114719.90714999998,-1,-1,-1,-1,-1,-1,-1,-1,106266.86135999998,-1,-1,144788.59860299999,118946.43004499999,88793.435978999987,114719.90714999998,120757.79699999999,null,null,"Calzado DamaCalzado casual para dama.16"]
["Calzado Dama","Calzado de calle para dama clima cálido.",1,6,{"$f":"ROUND(AVERAGE(IF(F338:Z338>-1,F338:Z338)),0)","v":113173},-1,-1,89964.558764999994,-1,114719.90714999998,-1,-1,-1,-1,-1,-1,-1,-1,106266.86135999998,-1,-1,144788.59860299999,118946.43004499999,91594.789024499987,118342.64105999999,120757.79699999999,null,null,"Calzado DamaCalzado de calle para dama clima cálido.16"]
["Calzado Dama","Cinturón.",1,6,{"$f":"ROUND(AVERAGE(IF(F339:Z339>-1,F339:Z339)),0)","v":45628},-1,-1,30672.480437999995,-1,42265.228949999997,-1,-1,-1,-1,-1,-1,-1,-1,36227.339099999997,-1,-1,42144.471152999991,59171.320529999997,31373.103505499996,62794.054439999993,60378.898499999996,null,null,"Calzado DamaCinturón.16"]
["Calzado Caballero","Calzado de calle para caballero formal.",1,6,{"$f":"ROUND(AVERAGE(IF(F340:Z340>-1,F340:Z340)),0)","v":115753},-1,-1,98055.331163999988,99021.39353999999,-1,-1,-1,-1,-1,-1,-1,-1,-1,111097.17324,-1,-1,156864.37830299998,120154.008015,100699.47122849998,124380.53090999999,-1,1,90,"Calzado CaballeroCalzado de calle para caballero formal.16"]
["Calzado Caballero","Calzado deportivo para caballero",1,6,{"$f":"ROUND(AVERAGE(IF(F341:Z341>-1,F341:Z341)),0)","v":116719},-1,-1,106508.37695399998,105663.07237499999,-1,-1,-1,-1,-1,-1,-1,-1,-1,111097.17324,-1,-1,156864.37830299998,111700.96222499998,109273.27481549999,115927.48512,-1,null,null,"Calzado CaballeroCalzado deportivo para caballero16"]
["Calzado Caballero","Calzado casual para caballero.",1,6,{"$f":"ROUND(AVERAGE(IF(F342:Z342>-1,F342:Z342)),0)","v":116098},-1,-1,106508.37695399998,96485.479802999995,-1,-1,-1,-1,-1,-1,-1,-1,-1,111097.17324,-1,-1,156864.37830299998,114116.11816499999,109273.27481549999,118342.64105999999,-1,1,8,"Calzado CaballeroCalzado casual para caballero.16"]
["Calzado Caballero","Cinturón",1,6,{"$f":"ROUND(AVERAGE(IF(F343:Z343>-1,F343:Z343)),0)","v":41746},-1,-1,29223.386874,33691.425362999995,-1,-1,-1,-1,-1,-1,-1,-1,-1,36227.339099999997,-1,-1,42144.471152999991,57963.742559999999,30176.917780499996,62794.054439999993,-1,null,null,"Calzado CaballeroCinturón16"]
["Ropa Dama","Sastre formal de dos piezas para dama: chaqueta y falda o pantalón (Opción Uno).",1,7,{"$f":"ROUND(AVERAGE(IF(F344:Z344>-1,F344:Z344)),0)","v":235854},263735.02864799998,213499.78509600001,-1,228232.23632999999,-1,-1,258892.18529849997,-1,-1,-1,-1,-1,-1,-1,214912.423476,-1,-1,-1,-1,-1,-1,null,null,"Ropa DamaSastre formal de dos piezas para dama: chaqueta y falda o pantalón (Opción Uno).17"]
["Ropa Dama","Sastre formal de dos piezas para dama: chaqueta y falda o pantalón (Opción Dos).",1,7,{"$f":"ROUND(AVERAGE(IF(F345:Z345>-1,F345:Z345)),0)","v":209899},195482.94962849998,210987.79507349999,-1,202873.09895999997,-1,-1,225817.08038999999,-1,-1,-1,-1,-1,-1,-1,214332.55820549998,-1,-1,-1,-1,-1,-1,null,null,"Ropa DamaSastre formal de dos piezas para dama: chaqueta y falda o pantalón (Opción Dos).17"]
["Ropa Dama","Sastre formal de tres piezas para dama: chaqueta, chaleco y falda o pantalón.",1,7,{"$f":"ROUND(AVERAGE(IF(F346:Z346>-1,F346:Z346)),0)","v":312400},397051.63653599995,270014.43409199995,-1,295856.60265000002,-1,-1,332083.94175,-1,-1,-1,-1,-1,-1,-1,266995.48916699993,-1,-1,-1,-1,-1,-1,null,null,"Ropa DamaSastre formal de tres piezas para dama: chaqueta, chaleco y falda o pantalón.17"]
["Ropa Dama","Blazer para dama.",1,7,{"$f":"ROUND(AVERAGE(IF(F347:Z347>-1,F347:Z347)),0)","v":189377},179252.41817699999,194661.568764,-1,199250.36504999999,-1,-1,179325.32854499997,-1,-1,-1,-1,-1,-1,-1,194396.12945549999,-1,-1,-1,-1,-1,-1,null,null,"Ropa DamaBlazer para dama.17"]
["Ropa Dama","Blusa formal manga larga para dama.",1,7,{"$f":"ROUND(AVERAGE(IF(F348:Z348>-1,F348:Z348)),0)","v":74490},69267.128048999992,71023.812227999995,-1,69435.733274999991,-1,-1,91655.167923000001,-1,-1,-1,-1,-1,-1,-1,71065.963534499984,-1,-1,-1,-1,-1,-1,null,null,"Ropa DamaBlusa formal manga larga para dama.17"]
["Ropa Dama","Blusa formal manga corta para dama.",1,7,{"$f":"ROUND(AVERAGE(IF(F349:Z349>-1,F349:Z349)),0)","v":70436},67818.034484999996,68509.543756500003,-1,67020.577334999994,-1,-1,82356.817554000008,-1,-1,-1,-1,-1,-1,-1,66477.167248500002,-1,-1,-1,-1,-1,-1,null,null,"Ropa DamaBlusa formal manga corta para dama.17"]
["Ropa Dama","Blusa sport o informal para dama.",1,7,{"$f":"ROUND(AVERAGE(IF(F350:Z350>-1,F350:Z350)),0)","v":72808},81149.239583999995,67639.176238499989,-1,65812.999364999996,-1,-1,82356.817554000008,-1,-1,-1,-1,-1,-1,-1,67080.956233499994,-1,-1,-1,-1,-1,-1,null,null,"Ropa DamaBlusa sport o informal para dama.17"]
["Ropa Dama","Blusa para dama.",1,7,{"$f":"ROUND(AVERAGE(IF(F351:Z351>-1,F351:Z351)),0)","v":68680},60861.929687999997,72840.875305499983,-1,70884.826839000001,-1,-1,73058.467184999987,-1,-1,-1,-1,-1,-1,-1,65752.620466499997,-1,-1,-1,-1,-1,-1,null,null,"Ropa DamaBlusa para dama.17"]
["Ropa Dama","Chaqueta casual o sport.",1,7,{"$f":"ROUND(AVERAGE(IF(F352:Z352>-1,F352:Z352)),0)","v":126385},120130.08430049999,114284.72339099999,-1,119550.21902999999,-1,-1,162056.96357399996,-1,-1,-1,-1,-1,-1,-1,115903.56140549999,-1,-1,-1,-1,-1,-1,null,null,"Ropa DamaChaqueta casual o sport.17"]
["Ropa Dama","Chaqueta de jean",1,7,{"$f":"ROUND(AVERAGE(IF(F353:Z353>-1,F353:Z353)),0)","v":126549},173891.22767999998,113029.29799199999,-1,107474.43932999999,-1,-1,100953.51829199999,-1,-1,-1,-1,-1,-1,-1,137398.44927149999,-1,-1,-1,-1,-1,-1,null,null,"Ropa DamaChaqueta de jean17"]
["Ropa Dama","Falda",1,7,{"$f":"ROUND(AVERAGE(IF(F354:Z354>-1,F354:Z354)),0)","v":78287},92741.988096000001,69073.459883999996,-1,67020.577334999994,-1,-1,92983.503689999998,-1,-1,-1,-1,-1,-1,-1,69616.869970499989,-1,-1,-1,-1,-1,-1,null,null,"Ropa DamaFalda17"]
["Ropa Dama","Gabán o abrigo para dama",1,7,{"$f":"ROUND(AVERAGE(IF(F355:Z355>-1,F355:Z355)),0)","v":206955},257938.65439199997,214755.21049499998,-1,206495.83286999998,-1,-1,146116.93436999997,-1,-1,-1,-1,-1,-1,-1,209466.93036599999,-1,-1,-1,-1,-1,-1,null,null,"Ropa DamaGabán o abrigo para dama17"]
["Ropa Dama","Pantalón formal",1,7,{"$f":"ROUND(AVERAGE(IF(F356:Z356>-1,F356:Z356)),0)","v":89935},94191.081659999982,83417.435563499996,-1,81994.544162999999,-1,-1,104938.52559299998,-1,-1,-1,-1,-1,-1,-1,85134.246884999986,-1,-1,-1,-1,-1,-1,null,null,"Ropa DamaPantalón formal17"]
["Ropa Dama","Pantalón drill formal",1,7,{"$f":"ROUND(AVERAGE(IF(F357:Z357>-1,F357:Z357)),0)","v":80231},92741.988096000001,75352.865327999985,-1,72333.920402999996,-1,-1,86341.824854999999,-1,-1,-1,-1,-1,-1,-1,74386.802951999998,-1,-1,-1,-1,-1,-1,null,null,"Ropa DamaPantalón drill formal17"]
["Ropa Dama","Jean clásico",1,7,{"$f":"ROUND(AVERAGE(IF(F358:Z358>-1,F358:Z358)),0)","v":71846},94191.081659999982,60282.064417499991,-1,58157.410724999994,-1,-1,86341.824854999999,-1,-1,-1,-1,-1,-1,-1,60258.14070299999,-1,-1,-1,-1,-1,-1,null,null,"Ropa DamaJean clásico17"]
["Ropa Dama","Jean informal",1,7,{"$f":"ROUND(AVERAGE(IF(F359:Z359>-1,F359:Z359)),0)","v":92916},137663.88858,72840.875305499983,-1,69918.764463,-1,-1,112908.54019499999,-1,-1,-1,-1,-1,-1,-1,71247.100229999996,-1,-1,-1,-1,-1,-1,null,null,"Ropa DamaJean informal17"]
["Ropa Dama","Camisa tipo polo",1,7,{"$f":"ROUND(AVERAGE(IF(F360:Z360>-1,F360:Z360)),0)","v":37507},42023.713355999993,31397.027219999996,-1,30793.238235000001,-1,-1,51805.094912999994,-1,-1,-1,-1,-1,-1,-1,31517.785016999998,-1,-1,-1,-1,-1,-1,null,null,"Ropa DamaCamisa tipo polo17"]
["Ropa Dama","Camiseta tipo T-shirt básica",1,7,{"$f":"ROUND(AVERAGE(IF(F361:Z361>-1,F361:Z361)),0)","v":20410},19562.763114000001,16326.226309499998,-1,15577.755812999998,-1,-1,34403.440675499995,-1,-1,-1,-1,-1,-1,-1,16181.544797999999,-1,-1,-1,-1,-1,-1,null,null,"Ropa DamaCamiseta tipo T-shirt básica17"]
["Ropa Dama","Bata o blusa labor",1,7,{"$f":"ROUND(AVERAGE(IF(F362:Z362>-1,F362:Z362)),0)","v":44968},50718.274739999993,31397.027219999996,-1,30068.691452999996,-1,-1,78238.520986499992,-1,-1,-1,-1,-1,-1,-1,34415.972145,-1,-1,-1,-1,-1,-1,null,null,"Ropa DamaBata o blusa labor17"]
["Ropa Dama","Pashmina",1,7,{"$f":"ROUND(AVERAGE(IF(F363:Z363>-1,F363:Z363)),0)","v":30503},13041.842075999999,25117.621775999996,-1,24151.559399999998,-1,-1,61103.445281999993,-1,-1,-1,-1,-1,-1,-1,29102.629076999998,-1,-1,-1,-1,-1,-1,null,null,"Ropa DamaPashmina17"]
["Ropa Dama","Vestido",1,7,{"$f":"ROUND(AVERAGE(IF(F364:Z364>-1,F364:Z364)),0)","v":151841},105783.83017199999,163264.54154399998,-1,158796.50305499998,-1,-1,172683.64971,-1,-1,-1,-1,-1,-1,-1,158675.74525800001,-1,-1,-1,-1,-1,-1,null,null,"Ropa DamaVestido17"]
["Ropa Dama","Logo corporativo (tamaño bolsillo)",1,7,{"$f":"ROUND(AVERAGE(IF(F365:Z365>-1,F365:Z365)),0)","v":7675},9660.6237599999986,6279.4054439999991,-1,5917.1320530000003,-1,-1,9032.9110604999987,-1,-1,-1,-1,-1,-1,-1,7486.9834139999994,-1,-1,-1,-1,-1,-1,null,null,"Ropa DamaLogo corporativo (tamaño bolsillo)17"]
["Ropa Dama","Logo corporativo (tamaño espalda)",1,7,{"$f":"ROUND(AVERAGE(IF(F366:Z366>-1,F366:Z366)),0)","v":13909},18113.669549999999,12935.8941975,-1,11955.021902999999,-1,-1,14346.254128499999,-1,-1,-1,-1,-1,-1,-1,12196.537496999999,-1,-1,-1,-1,-1,-1,null,null,"Ropa DamaLogo corporativo (tamaño espalda)17"]
["Ropa Caballero","Vestido formal de dos piezas para hombre: saco y pantalón (Opción uno).",1,7,{"$f":"ROUND(AVERAGE(IF(F367:Z367>-1,F367:Z367)),0)","v":262512},-1,238617.40687199999,-1,301773.73470299999,-1,-1,-1,-1,-1,-1,-1,-1,-1,-1,236745.66101849999,272912.62121999997,-1,-1,-1,-1,-1,null,null,"Ropa CaballeroVestido formal de dos piezas para hombre: saco y pantalón (Opción uno).17"]
["Ropa Caballero","Vestido formal de dos piezas para hombre: saco y pantalón (Opción dos).",1,7,{"$f":"ROUND(AVERAGE(IF(F368:Z368>-1,F368:Z368)),0)","v":253778},-1,226058.59598399999,-1,264459.57542999997,-1,-1,-1,-1,-1,-1,-1,-1,-1,-1,222701.30138249998,301894.49249999999,-1,-1,-1,-1,-1,null,null,"Ropa CaballeroVestido formal de dos piezas para hombre: saco y pantalón (Opción dos).17"]
["Ropa Caballero","Camisa formal manga larga (Tipo uno, recomendable clima cálido).",1,7,{"$f":"ROUND(AVERAGE(IF(F369:Z369>-1,F369:Z369)),0)","v":64394},-1,62794.054439999993,-1,62069.507657999995,-1,-1,-1,-1,-1,-1,-1,-1,-1,-1,62673.296642999994,70039.522259999998,-1,-1,-1,-1,-1,null,null,"Ropa CaballeroCamisa formal manga larga (Tipo uno, recomendable clima cálido).17"]
["Ropa Caballero","Camisa formal manga corta (Tipo uno, recomendable clima cálido).",1,7,{"$f":"ROUND(AVERAGE(IF(F370:Z370>-1,F370:Z370)),0)","v":59280},-1,56514.648995999996,-1,56152.375604999994,-1,-1,-1,-1,-1,-1,-1,-1,-1,-1,55621.496987999999,68831.944289999999,-1,-1,-1,-1,-1,null,null,"Ropa CaballeroCamisa formal manga corta (Tipo uno, recomendable clima cálido).17"]
["Ropa Caballero","Camisa formal manga larga para caballero (Tipo dos).",1,7,{"$f":"ROUND(AVERAGE(IF(F371:Z371>-1,F371:Z371)),0)","v":67745},-1,62794.054439999993,-1,62190.265454999993,-1,-1,-1,-1,-1,-1,-1,-1,-1,-1,62673.296642999994,83322.879929999996,-1,-1,-1,-1,-1,null,null,"Ropa CaballeroCamisa formal manga larga para caballero (Tipo dos).17"]
["Ropa Caballero","Camisa formal manga corta para caballero (Tipo dos).",1,7,{"$f":"ROUND(AVERAGE(IF(F372:Z372>-1,F372:Z372)),0)","v":61695},-1,56514.648995999996,-1,56152.375604999994,-1,-1,-1,-1,-1,-1,-1,-1,-1,-1,55621.496987999999,78492.568050000002,-1,-1,-1,-1,-1,null,null,"Ropa CaballeroCamisa formal manga corta para caballero (Tipo dos).17"]
["Ropa Caballero","Corbata",1,7,{"$f":"ROUND(AVERAGE(IF(F373:Z373>-1,F373:Z373)),0)","v":26993},-1,18838.216331999996,-1,22823.223632999998,-1,-1,-1,-1,-1,-1,-1,-1,-1,-1,25250.911042499996,41057.650979999991,-1,-1,-1,-1,-1,null,null,"Ropa CaballeroCorbata17"]
["Ropa Caballero","Chaqueta casual o sport.",1,7,{"$f":"ROUND(AVERAGE(IF(F374:Z374>-1,F374:Z374)),0)","v":118337},-1,96703.071682499984,-1,107957.47051799999,-1,-1,-1,-1,-1,-1,-1,-1,-1,-1,97210.026584999985,171476.07173999998,-1,-1,-1,-1,-1,null,null,"Ropa CaballeroChaqueta casual o sport.17"]
["Ropa Caballero","Chaqueta de jean",1,7,{"$f":"ROUND(AVERAGE(IF(F375:Z375>-1,F375:Z375)),0)","v":124160},-1,109261.88257049999,-1,107353.68153299998,-1,-1,-1,-1,-1,-1,-1,-1,-1,-1,110963.88397349999,169060.91579999999,-1,-1,-1,-1,-1,null,null,"Ropa CaballeroChaqueta de jean17"]
["Ropa Caballero","Chaqueta de drill",1,7,{"$f":"ROUND(AVERAGE(IF(F376:Z376>-1,F376:Z376)),0)","v":123997},-1,113029.29799199999,-1,107353.68153299998,-1,-1,-1,-1,-1,-1,-1,-1,-1,-1,107752.41010799998,167853.33783,-1,-1,-1,-1,-1,null,null,"Ropa CaballeroChaqueta de drill17"]
["Ropa Caballero","Blazer para hombre.",1,7,{"$f":"ROUND(AVERAGE(IF(F377:Z377>-1,F377:Z377)),0)","v":190163},-1,169543.94698800001,-1,216156.45663,-1,-1,-1,-1,-1,-1,-1,-1,-1,-1,170872.28275499999,204080.67692999999,-1,-1,-1,-1,-1,null,null,"Ropa CaballeroBlazer para hombre.17"]
["Ropa Caballero","Camisa sport o informal",1,7,{"$f":"ROUND(AVERAGE(IF(F378:Z378>-1,F378:Z378)),0)","v":66360},-1,62794.054439999993,-1,61465.718672999988,-1,-1,-1,-1,-1,-1,-1,-1,-1,-1,62685.828112499992,78492.568050000002,-1,-1,-1,-1,-1,null,null,"Ropa CaballeroCamisa sport o informal17"]
["Ropa Caballero","Camiseta tipo t-shirt blanca",1,7,{"$f":"ROUND(AVERAGE(IF(F379:Z379>-1,F379:Z379)),0)","v":19068},-1,11303.385488999998,-1,11471.990714999998,-1,-1,-1,-1,-1,-1,-1,-1,-1,-1,12438.053091,41057.650979999991,-1,-1,-1,-1,-1,null,null,"Ropa CaballeroCamiseta tipo t-shirt blanca17"]
["Ropa Caballero","Camiseta tipo t-shirt estampada",1,7,{"$f":"ROUND(AVERAGE(IF(F380:Z380>-1,F380:Z380)),0)","v":25299},-1,15070.8009105,-1,20408.067692999997,-1,-1,-1,-1,-1,-1,-1,-1,-1,-1,14997.890542499999,50718.274739999993,-1,-1,-1,-1,-1,null,null,"Ropa CaballeroCamiseta tipo t-shirt estampada17"]
["Ropa Caballero","Camisa tipo polo",1,7,{"$f":"ROUND(AVERAGE(IF(F381:Z381>-1,F381:Z381)),0)","v":36408},-1,31397.027219999996,-1,30793.238235000001,-1,-1,-1,-1,-1,-1,-1,-1,-1,-1,30310.207047,53133.43067999999,-1,-1,-1,-1,-1,null,null,"Ropa CaballeroCamisa tipo polo17"]
["Ropa Caballero","Pantalón de dril formal",1,7,{"$f":"ROUND(AVERAGE(IF(F382:Z382>-1,F382:Z382)),0)","v":73662},-1,69073.459883999996,-1,66296.03055299999,-1,-1,-1,-1,-1,-1,-1,-1,-1,-1,69918.764463,89360.769779999988,-1,-1,-1,-1,-1,null,null,"Ropa CaballeroPantalón de dril formal17"]
["Ropa Caballero","Jean clásico",1,7,{"$f":"ROUND(AVERAGE(IF(F383:Z383>-1,F383:Z383)),0)","v":62266},-1,56514.648995999996,-1,54220.25085299999,-1,-1,-1,-1,-1,-1,-1,-1,-1,-1,55005.176533499995,83322.879929999996,-1,-1,-1,-1,-1,null,null,"Ropa CaballeroJean clásico17"]
["Ropa Caballero","Jean informal",1,7,{"$f":"ROUND(AVERAGE(IF(F384:Z384>-1,F384:Z384)),0)","v":71836},-1,62794.054439999993,-1,60258.14070299999,-1,-1,-1,-1,-1,-1,-1,-1,-1,-1,62854.433338499992,101436.54947999999,-1,-1,-1,-1,-1,null,null,"Ropa CaballeroJean informal17"]
["Ropa Caballero","Bata o blusa labor",1,7,{"$f":"ROUND(AVERAGE(IF(F385:Z385>-1,F385:Z385)),0)","v":29761},-1,11931.098188499998,-1,31276.269422999998,-1,-1,-1,-1,-1,-1,-1,-1,-1,-1,34778.245535999995,41057.650979999991,-1,-1,-1,-1,-1,null,null,"Ropa CaballeroBata o blusa labor17"]
["Ropa Caballero","Calcetín para calzado calle",1,7,{"$f":"ROUND(AVERAGE(IF(F386:Z386>-1,F386:Z386)),0)","v":11997},-1,11303.385488999998,-1,10868.201729999999,-1,-1,-1,-1,-1,-1,-1,-1,-1,-1,11327.309203499999,14490.93564,-1,-1,-1,-1,-1,null,null,{"$f":"A386&B386&C386&D386","v":"Ropa CaballeroCalcetín para calzado calle17"}]
["Ropa Caballero","Calcetín para calzado deportivo",1,7,{"$f":"ROUND(AVERAGE(IF(F387:Z387>-1,F387:Z387)),0)","v":12879},-1,11931.098188499998,-1,11351.232918,-1,-1,-1,-1,-1,-1,-1,-1,-1,-1,11327.309203499999,16906.09158,-1,-1,-1,-1,-1,null,null,"Ropa CaballeroCalcetín para calzado deportivo17"]
["Ropa Caballero","Pantaloncillo tipo bóxer.",1,7,{"$f":"ROUND(AVERAGE(IF(F388:Z388>-1,F388:Z388)),0)","v":19569},-1,31397.027219999996,-1,15577.755812999998,-1,-1,-1,-1,-1,-1,-1,-1,-1,-1,11978.9456175,19321.247519999997,-1,-1,-1,-1,-1,null,null,"Ropa CaballeroPantaloncillo tipo bóxer.17"]
["Ropa Caballero","Gorra o cachucha",1,7,{"$f":"ROUND(AVERAGE(IF(F389:Z389>-1,F389:Z389)),0)","v":22050},-1,18838.216331999996,-1,22823.223632999998,-1,-1,-1,-1,-1,-1,-1,-1,-1,-1,19972.883933999998,26566.715339999995,-1,-1,-1,-1,-1,null,null,"Ropa CaballeroGorra o cachucha17"]
["Ropa Caballero","Tula / Morral",1,7,{"$f":"ROUND(AVERAGE(IF(F390:Z390>-1,F390:Z390)),0)","v":80404},-1,71585.449906499998,-1,70039.522259999998,-1,-1,-1,-1,-1,-1,-1,-1,-1,-1,72515.057098499994,107474.43932999999,-1,-1,-1,-1,-1,null,null,"Ropa CaballeroTula / Morral17"]
["Ropa Caballero","Logo corporativo (tamaño bolsillo)",1,7,{"$f":"ROUND(AVERAGE(IF(F391:Z391>-1,F391:Z391)),0)","v":10283},-1,6279.4054439999991,-1,5917.1320530000003,-1,-1,-1,-1,-1,-1,-1,-1,-1,-1,7197.6203909999995,21736.403459999998,-1,-1,-1,-1,-1,null,null,"Ropa CaballeroLogo corporativo (tamaño bolsillo)17"]
["Ropa Caballero","Logo corporativo (tamaño espalda)",1,7,{"$f":"ROUND(AVERAGE(IF(F392:Z392>-1,F392:Z392)),0)","v":16707},-1,12558.810887999998,-1,11955.021902999999,-1,-1,-1,-1,-1,-1,-1,-1,-1,-1,12123.627128999999,30189.449249999998,-1,-1,-1,-1,-1,null,null,"Ropa CaballeroLogo corporativo (tamaño espalda)17"]
["Calzado Dama","Calzado de calle para dama.",1,7,{"$f":"ROUND(AVERAGE(IF(F393:Z393>-1,F393:Z393)),0)","v":108375},-1,90423.666238499995,-1,96485.479802999995,114719.90714999998,-1,-1,-1,-1,-1,-1,-1,-1,-1,-1,-1,144788.59860299999,-1,95459.038528499994,-1,-1,null,null,"Calzado DamaCalzado de calle para dama.17"]
["Calzado Dama","Calzado casual para dama.",1,7,{"$f":"ROUND(AVERAGE(IF(F394:Z394>-1,F394:Z394)),0)","v":106636},-1,90423.666238499995,-1,89964.558764999994,114719.90714999998,-1,-1,-1,-1,-1,-1,-1,-1,-1,-1,-1,144788.59860299999,-1,93285.398182499994,-1,-1,null,null,"Calzado DamaCalzado casual para dama.17"]
["Calzado Dama","Calzado de calle para dama clima cálido.",1,7,{"$f":"ROUND(AVERAGE(IF(F395:Z395>-1,F395:Z395)),0)","v":108982},-1,92935.656260999996,-1,96485.479802999995,114719.90714999998,-1,-1,-1,-1,-1,-1,-1,-1,-1,-1,-1,144788.59860299999,-1,95978.524900499993,-1,-1,null,null,"Calzado DamaCalzado de calle para dama clima cálido.17"]
["Calzado Dama","Cinturón.",1,7,{"$f":"ROUND(AVERAGE(IF(F396:Z396>-1,F396:Z396)),0)","v":36556},-1,31397.027219999996,-1,33691.425362999995,42265.228949999997,-1,-1,-1,-1,-1,-1,-1,-1,-1,-1,-1,42144.471152999991,-1,33281.304542999998,-1,-1,null,null,"Calzado DamaCinturón.17"]
["Calzado Caballero","Calzado de calle para caballero formal.",1,7,{"$f":"ROUND(AVERAGE(IF(F397:Z397>-1,F397:Z397)),0)","v":121180},-1,100470.48710399999,-1,99021.39353999999,-1,-1,-1,-1,-1,-1,-1,-1,-1,-1,-1,143701.77843000001,156864.37830299998,-1,105844.20907049999,-1,-1,null,null,"Calzado CaballeroCalzado de calle para caballero formal.17"]
["Calzado Caballero","Calzado deportivo para caballero",1,7,{"$f":"ROUND(AVERAGE(IF(F398:Z398>-1,F398:Z398)),0)","v":128479},-1,109261.88257049999,-1,105663.07237499999,-1,-1,-1,-1,-1,-1,-1,-1,-1,-1,-1,155777.55812999999,156864.37830299998,-1,114828.1334775,-1,-1,null,null,"Calzado CaballeroCalzado deportivo para caballero17"]
["Calzado Caballero","Calzado casual para caballero.",1,7,{"$f":"ROUND(AVERAGE(IF(F399:Z399>-1,F399:Z399)),0)","v":126643},-1,109261.88257049999,-1,96485.479802999995,-1,-1,-1,-1,-1,-1,-1,-1,-1,-1,-1,155777.55812999999,156864.37830299998,-1,114828.1334775,-1,-1,null,null,"Calzado CaballeroCalzado casual para caballero.17"]
["Calzado Caballero","Cinturón",1,7,{"$f":"ROUND(AVERAGE(IF(F400:Z400>-1,F400:Z400)),0)","v":35756},-1,30141.601821,-1,33691.425362999995,-1,-1,-1,-1,-1,-1,-1,-1,-1,-1,-1,41057.650979999991,42144.471152999991,-1,31746.769141499997,-1,-1,null,null,"Calzado CaballeroCinturón17"]
["Ropa Dama","Sastre formal de dos piezas para dama: chaqueta y falda o pantalón (Opción Uno).",2,null,{"$f":"ROUND(AVERAGE(IF(F401:Z401>-1,F401:Z401)),0)","v":216070},-1,213499.78509600001,208910.98880999998,212775.23831399999,-1,213741.30068999997,-1,-1,219448.815435,-1,209394.01999799997,241394.83620299998,209394.01999799997,-1,-1,-1,-1,-1,-1,-1,-1,null,null,"Ropa DamaSastre formal de dos piezas para dama: chaqueta y falda o pantalón (Opción Uno).2"]
["Ropa Dama","Sastre formal de dos piezas para dama: chaqueta y falda o pantalón (Opción Dos).",2,null,{"$f":"ROUND(AVERAGE(IF(F402:Z402>-1,F402:Z402)),0)","v":205880},-1,210987.79507349999,206495.83286999998,202873.09895999997,-1,213572.69546399999,-1,-1,161145.58397399998,-1,203839.16133599999,241394.83620299998,206728.23466799999,-1,-1,-1,-1,-1,-1,-1,-1,null,null,"Ropa DamaSastre formal de dos piezas para dama: chaqueta y falda o pantalón (Opción Dos).2"]
["Ropa Dama","Sastre formal de tres piezas para dama: chaqueta, chaleco y falda o pantalón.",2,null,{"$f":"ROUND(AVERAGE(IF(F403:Z403>-1,F403:Z403)),0)","v":261484},-1,270014.43409199995,264459.57542999997,265546.39560299995,-1,288115.57217249996,-1,-1,219448.815435,-1,254436.67827899996,265546.39560299995,264302.36244899995,-1,-1,-1,-1,-1,-1,-1,-1,null,null,"Ropa DamaSastre formal de tres piezas para dama: chaqueta, chaleco y falda o pantalón.2"]
["Ropa Dama","Blazer para dama.",2,null,{"$f":"ROUND(AVERAGE(IF(F404:Z404>-1,F404:Z404)),0)","v":180083},-1,194661.568764,190797.31925999999,196835.20911,-1,189505.438677,-1,-1,128857.68319499999,-1,192789.82291049999,156864.37830299998,190356.43937849998,-1,-1,-1,-1,-1,-1,-1,-1,null,null,"Ropa DamaBlazer para dama.2"]
["Ropa Dama","Blusa formal manga larga para dama.",2,null,{"$f":"ROUND(AVERAGE(IF(F405:Z405>-1,F405:Z405)),0)","v":66856},-1,71023.812227999995,68831.944289999999,69435.733274999991,-1,71042.039820000005,-1,-1,47583.128915999994,-1,70401.795650999993,67141.335131999993,69384.468172499997,-1,-1,-1,-1,-1,-1,-1,-1,null,null,"Ropa DamaBlusa formal manga larga para dama.2"]
["Ropa Dama","Blusa formal manga corta para dama.",2,null,{"$f":"ROUND(AVERAGE(IF(F406:Z406>-1,F406:Z406)),0)","v":63183},-1,68509.543756500003,66416.788349999988,67020.577334999994,-1,64508.587312499993,-1,-1,44020.773904499998,-1,67865.881913999998,60258.14070299999,66862.225129500002,-1,-1,-1,-1,-1,-1,-1,-1,null,null,"Ropa DamaBlusa formal manga corta para dama.2"]
["Ropa Dama","Blusa sport o informal para dama.",2,null,{"$f":"ROUND(AVERAGE(IF(F407:Z407>-1,F407:Z407)),0)","v":64665},-1,67639.176238499989,66416.788349999988,65812.999364999996,-1,66839.440639499997,-1,-1,50500.682860499997,-1,67020.577334999994,67141.335131999993,65948.567080499997,-1,-1,-1,-1,-1,-1,-1,-1,null,null,"Ropa DamaBlusa sport o informal para dama.2"]
["Ropa Dama","Blusa para dama.",2,null,{"$f":"ROUND(AVERAGE(IF(F408:Z408>-1,F408:Z408)),0)","v":67358},-1,72840.875305499983,71247.100229999996,70884.826839000001,-1,66006.667529999992,-1,-1,47583.128915999994,-1,72213.162605999998,67141.335131999993,70949.762635499996,-1,-1,-1,-1,-1,-1,-1,-1,null,null,"Ropa DamaBlusa para dama.2"]
["Ropa Dama","Chaqueta casual o sport.",2,null,{"$f":"ROUND(AVERAGE(IF(F409:Z409>-1,F409:Z409)),0)","v":115570},-1,114284.72339099999,111097.17324,110493.384255,-1,114465.86008649999,-1,-1,129099.19878899999,-1,113270.81358599999,120637.03920299999,111208.81724099998,-1,-1,-1,-1,-1,-1,-1,-1,null,null,"Ropa DamaChaqueta casual o sport.2"]
["Ropa Dama","Chaqueta de jean",2,null,{"$f":"ROUND(AVERAGE(IF(F410:Z410>-1,F410:Z410)),0)","v":122608},-1,113029.29799199999,137663.88858,107474.43932999999,-1,137265.16000499998,-1,-1,114599.14935299999,-1,140320.56011399999,120637.03920299999,109877.06380049999,-1,-1,-1,-1,-1,-1,-1,-1,null,null,"Ropa DamaChaqueta de jean2"]
["Ropa Dama","Falda",2,null,{"$f":"ROUND(AVERAGE(IF(F411:Z411>-1,F411:Z411)),0)","v":83672},-1,69073.459883999996,67624.366320000001,67020.577334999994,-1,208910.98880999998,-1,-1,62190.265454999993,-1,68348.913101999991,59123.473100999996,67080.956233499994,-1,-1,-1,-1,-1,-1,-1,-1,null,null,"Ropa DamaFalda2"]
["Ropa Dama","Gabán o abrigo para dama",2,null,{"$f":"ROUND(AVERAGE(IF(F412:Z412>-1,F412:Z412)),0)","v":194623},-1,214755.21049499998,210118.56677999999,206495.83286999998,-1,205844.19645599998,-1,-1,132474.7209825,-1,200216.42742599998,178721.53955999998,208353.90802949999,-1,-1,-1,-1,-1,-1,-1,-1,null,null,"Ropa DamaGabán o abrigo para dama2"]
["Ropa Dama","Pantalón formal",2,null,{"$f":"ROUND(AVERAGE(IF(F413:Z413>-1,F413:Z413)),0)","v":83735},-1,83417.435563499996,80907.723989999999,81994.544162999999,-1,85110.323170499993,-1,-1,90589.993015499989,-1,82598.333148000005,84409.700102999996,80850.762764999992,-1,-1,-1,-1,-1,-1,-1,-1,null,null,"Ropa DamaPantalón formal2"]
["Ropa Dama","Pantalón drill formal",2,null,{"$f":"ROUND(AVERAGE(IF(F414:Z414>-1,F414:Z414)),0)","v":75675},-1,75352.865327999985,73662.256169999993,72333.920402999996,-1,74024.529561000003,-1,-1,70299.26544599999,-1,70281.037853999995,96485.479802999995,72961.633102499996,-1,-1,-1,-1,-1,-1,-1,-1,null,null,"Ropa DamaPantalón drill formal2"]
["Ropa Dama","Jean clásico",2,null,{"$f":"ROUND(AVERAGE(IF(F415:Z415>-1,F415:Z415)),0)","v":64887},-1,60282.064417499991,59171.320529999997,58157.410724999994,-1,60499.656297000001,-1,-1,66416.788349999988,-1,59775.109514999996,96485.479802999995,58311.206032499998,-1,-1,-1,-1,-1,-1,-1,-1,null,null,"Ropa DamaJean clásico2"]
["Ropa Dama","Jean informal",2,null,{"$f":"ROUND(AVERAGE(IF(F416:Z416>-1,F416:Z416)),0)","v":75551},-1,72840.875305499983,71247.100229999996,69918.764463,-1,70522.553447999991,-1,-1,80907.723989999999,-1,72092.404809,96485.479802999995,70389.264181499995,-1,-1,-1,-1,-1,-1,-1,-1,null,null,"Ropa DamaJean informal2"]
["Ropa Dama","Camisa tipo polo",2,null,{"$f":"ROUND(AVERAGE(IF(F417:Z417>-1,F417:Z417)),0)","v":33837},-1,31397.027219999996,30189.449249999998,30793.238235000001,-1,30998.298644999999,-1,-1,41048.537183999993,-1,36106.581302999999,39850.073009999993,30310.207047,-1,-1,-1,-1,-1,-1,-1,-1,null,null,"Ropa DamaCamisa tipo polo2"]
["Ropa Dama","Camiseta tipo T-shirt básica",2,null,{"$f":"ROUND(AVERAGE(IF(F418:Z418>-1,F418:Z418)),0)","v":20135},-1,16326.226309499998,15698.513609999998,15577.755812999998,-1,15819.271406999998,-1,-1,38322.372955499995,-1,13524.873263999998,30068.691452999996,15745.221814499999,-1,-1,-1,-1,-1,-1,-1,-1,null,null,"Ropa DamaCamiseta tipo T-shirt básica2"]
["Ropa Dama","Bata o blusa labor",2,null,{"$f":"ROUND(AVERAGE(IF(F419:Z419>-1,F419:Z419)),0)","v":31821},-1,31397.027219999996,31397.027219999996,30068.691452999996,-1,34053.698753999997,-1,-1,46560.105314999993,-1,29223.386874,21615.645662999999,30249.828148500001,-1,-1,-1,-1,-1,-1,-1,-1,null,null,"Ropa DamaBata o blusa labor2"]
["Ropa Dama","Pashmina",2,null,{"$f":"ROUND(AVERAGE(IF(F420:Z420>-1,F420:Z420)),0)","v":22170},-1,25117.621775999996,25359.137369999997,24151.559399999998,-1,28800.734584499998,-1,-1,8334.5664419999994,-1,23427.012617999997,17992.911753,24175.483114499995,-1,-1,-1,-1,-1,-1,-1,-1,null,null,"Ropa DamaPashmina2"]
["Ropa Dama","Vestido",2,null,{"$f":"ROUND(AVERAGE(IF(F421:Z421>-1,F421:Z421)),0)","v":135623},-1,163264.54154399998,159400.29203999997,155777.55812999999,-1,159521.04983699997,-1,-1,72636.954119999995,-1,161815.44798,55427.828822999996,157142.34908099999,-1,-1,-1,-1,-1,-1,-1,-1,null,null,"Ropa DamaVestido2"]
["Ropa Dama","Logo corporativo (tamaño bolsillo)",2,null,{"$f":"ROUND(AVERAGE(IF(F422:Z422>-1,F422:Z422)),0)","v":6162},-1,6279.4054439999991,6762.436631999999,5917.1320530000003,-1,7197.6203909999995,-1,-1,5209.6736384999995,-1,5856.7531544999993,6025.3583804999998,6050.4213194999993,-1,-1,-1,-1,-1,-1,-1,-1,null,null,"Ropa DamaLogo corporativo (tamaño bolsillo)2"]
["Ropa Dama","Logo corporativo (tamaño espalda)",2,null,{"$f":"ROUND(AVERAGE(IF(F423:Z423>-1,F423:Z423)),0)","v":13076},-1,12935.8941975,12075.779699999999,11955.021902999999,-1,12063.248230499999,-1,-1,25003.699325999994,-1,11713.506308999999,6387.6317714999996,12475.647499499999,-1,-1,-1,-1,-1,-1,-1,-1,null,null,"Ropa DamaLogo corporativo (tamaño espalda)2"]
["Ropa Caballero","Vestido formal de dos piezas para hombre: saco y pantalón (Opción uno).",2,null,{"$f":"ROUND(AVERAGE(IF(F424:Z424>-1,F424:Z424)),0)","v":276264},-1,238617.40687199999,233183.30600699998,238979.68026299999,-1,236745.66101849999,-1,-1,354216.79533599998,-1,271705.04324999999,289818.71279999998,234028.61058599997,389081.621934,-1,-1,-1,-1,-1,-1,-1,null,null,"Ropa CaballeroVestido formal de dos piezas para hombre: saco y pantalón (Opción uno).2"]
["Ropa Caballero","Vestido formal de dos piezas para hombre: saco y pantalón (Opción dos).",2,null,{"$f":"ROUND(AVERAGE(IF(F425:Z425>-1,F425:Z425)),0)","v":264154},-1,226058.59598399999,221107.52630699996,228232.23632999999,-1,222701.30138249998,-1,-1,358384.07855699991,-1,259629.26354999997,289818.71279999998,221493.72341249997,349956.09570599993,-1,-1,-1,-1,-1,-1,-1,null,null,"Ropa CaballeroVestido formal de dos piezas para hombre: saco y pantalón (Opción dos).2"]
["Ropa Caballero","Camisa formal manga larga (Tipo uno, recomendable clima cálido).",2,null,{"$f":"ROUND(AVERAGE(IF(F426:Z426>-1,F426:Z426)),0)","v":65287},-1,62794.054439999993,61707.234267,60258.14070299999,-1,62673.296642999994,-1,-1,50572.454003999992,-1,71126.342432999998,71126.342432999998,61465.718672999988,85858.793666999991,-1,-1,-1,-1,-1,-1,-1,null,null,"Ropa CaballeroCamisa formal manga larga (Tipo uno, recomendable clima cálido).2"]
["Ropa Caballero","Camisa formal manga corta (Tipo uno, recomendable clima cálido).",2,null,{"$f":"ROUND(AVERAGE(IF(F427:Z427>-1,F427:Z427)),0)","v":60066},-1,56514.648995999996,55669.344417,54220.25085299999,-1,55621.496987999999,-1,-1,44371.655050499998,-1,66296.03055299999,71126.342432999998,55264.919719499994,81511.512975000005,-1,-1,-1,-1,-1,-1,-1,null,null,"Ropa CaballeroCamisa formal manga corta (Tipo uno, recomendable clima cálido).2"]
["Ropa Caballero","Camisa formal manga larga para caballero (Tipo dos).",2,null,{"$f":"ROUND(AVERAGE(IF(F428:Z428>-1,F428:Z428)),0)","v":66985},-1,62794.054439999993,61707.234267,60258.14070299999,-1,62673.296642999994,-1,-1,56196.805360500002,-1,71126.342432999998,71126.342432999998,61344.96087599999,95640.175223999991,-1,-1,-1,-1,-1,-1,-1,null,null,"Ropa CaballeroCamisa formal manga larga para caballero (Tipo dos).2"]
["Ropa Caballero","Camisa formal manga corta para caballero (Tipo dos).",2,null,{"$f":"ROUND(AVERAGE(IF(F429:Z429>-1,F429:Z429)),0)","v":61420},-1,56514.648995999996,55669.344417,54220.25085299999,-1,55621.496987999999,-1,-1,49059.563867999997,-1,66296.03055299999,71126.342432999998,55156.693392000001,89119.254185999991,-1,-1,-1,-1,-1,-1,-1,null,null,"Ropa CaballeroCamisa formal manga corta para caballero (Tipo dos).2"]
["Ropa Caballero","Corbata",2,null,{"$f":"ROUND(AVERAGE(IF(F430:Z430>-1,F430:Z430)),0)","v":23541},-1,18838.216331999996,18234.427346999997,19200.489722999999,-1,25250.911042499996,-1,-1,27087.340936500001,-1,21736.403459999998,24030.801602999996,18367.716613500001,39125.526228000002,-1,-1,-1,-1,-1,-1,-1,null,null,"Ropa CaballeroCorbata2"]
["Ropa Caballero","Chaqueta casual o sport.",2,null,{"$f":"ROUND(AVERAGE(IF(F431:Z431>-1,F431:Z431)),0)","v":108357},-1,96703.071682499984,95519.417426999978,94191.081659999982,-1,97210.026584999985,-1,-1,104933.96869499999,-1,95760.933021000004,120637.03920299999,94192.220884499984,176064.86802599998,-1,-1,-1,-1,-1,-1,-1,null,null,"Ropa CaballeroChaqueta casual o sport.2"]
["Ropa Caballero","Chaqueta de jean",2,null,{"$f":"ROUND(AVERAGE(IF(F432:Z432>-1,F432:Z432)),0)","v":117948},-1,109261.88257049999,111217.93103699999,107353.68153299998,-1,110963.88397349999,-1,-1,128122.88339249999,-1,111942.47781899999,120637.03920299999,109877.06380049999,152154.82421999998,-1,-1,-1,-1,-1,-1,-1,null,null,"Ropa CaballeroChaqueta de jean2"]
["Ropa Caballero","Chaqueta de drill",2,null,{"$f":"ROUND(AVERAGE(IF(F433:Z433>-1,F433:Z433)),0)","v":114733},-1,113029.29799199999,106387.61915699999,107353.68153299998,-1,107752.41010799998,-1,-1,110758.82356349999,-1,108198.98611199998,120637.03920299999,106320.40491149999,152154.82421999998,-1,-1,-1,-1,-1,-1,-1,null,null,"Ropa CaballeroChaqueta de drill2"]
["Ropa Caballero","Blazer para hombre.",2,null,{"$f":"ROUND(AVERAGE(IF(F434:Z434>-1,F434:Z434)),0)","v":185701},-1,169543.94698800001,166766.51765699999,167853.33783,-1,170872.28275499999,-1,-1,309460.08240449999,-1,145513.14538499998,181015.93770299997,164653.25620949999,195627.63113999998,-1,-1,-1,-1,-1,-1,-1,null,null,"Ropa CaballeroBlazer para hombre.2"]
["Ropa Caballero","Camisa sport o informal",2,null,{"$f":"ROUND(AVERAGE(IF(F435:Z435>-1,F435:Z435)),0)","v":62982},-1,62794.054439999993,61707.234267,60258.14070299999,-1,62685.828112499992,-1,-1,56196.805360500002,-1,66416.788349999988,66296.03055299999,60922.308586499988,69556.49107199999,-1,-1,-1,-1,-1,-1,-1,null,null,"Ropa CaballeroCamisa sport o informal2"]
["Ropa Caballero","Camiseta tipo t-shirt blanca",2,null,{"$f":"ROUND(AVERAGE(IF(F436:Z436>-1,F436:Z436)),0)","v":17310},-1,11303.385488999998,12196.537496999999,11471.990714999998,-1,12438.053091,-1,-1,22920.057715499996,-1,13524.873263999998,24030.801602999996,10954.782792,36951.885881999995,-1,-1,-1,-1,-1,-1,-1,null,null,"Ropa CaballeroCamiseta tipo t-shirt blanca2"]
["Ropa Caballero","Camiseta tipo t-shirt estampada",2,null,{"$f":"ROUND(AVERAGE(IF(F437:Z437>-1,F437:Z437)),0)","v":22562},-1,15070.8009105,14611.693437,15094.724624999999,-1,14997.890542499999,-1,-1,34379.516960999994,-1,31155.511625999996,24030.801602999996,14592.326620499998,39125.526228000002,-1,-1,-1,-1,-1,-1,-1,null,null,"Ropa CaballeroCamiseta tipo t-shirt estampada2"]
["Ropa Caballero","Camisa tipo polo",2,null,{"$f":"ROUND(AVERAGE(IF(F438:Z438>-1,F438:Z438)),0)","v":34918},-1,31397.027219999996,30310.207047,30793.238235000001,-1,30310.207047,-1,-1,41048.537183999993,-1,36106.581302999999,36106.581302999999,30370.585945499999,47820.087611999996,-1,-1,-1,-1,-1,-1,-1,null,null,"Ropa CaballeroCamisa tipo polo2"]
["Ropa Caballero","Pantalón de dril formal",2,null,{"$f":"ROUND(AVERAGE(IF(F439:Z439>-1,F439:Z439)),0)","v":75508},-1,69073.459883999996,67745.124116999999,66296.03055299999,-1,69918.764463,-1,-1,83663.508055499988,-1,68348.913101999991,96485.479802999995,66749.441903999992,91292.894531999991,-1,-1,-1,-1,-1,-1,-1,null,null,"Ropa CaballeroPantalón de dril formal2"]
["Ropa Caballero","Jean clásico",2,null,{"$f":"ROUND(AVERAGE(IF(F440:Z440>-1,F440:Z440)),0)","v":66045},-1,56514.648995999996,55669.344417,54220.25085299999,-1,55005.176533499995,-1,-1,66416.788349999988,-1,66416.788349999988,96485.479802999995,54558.6005295,89119.254185999991,-1,-1,-1,-1,-1,-1,-1,null,null,"Ropa CaballeroJean clásico2"]
["Ropa Caballero","Jean informal",2,null,{"$f":"ROUND(AVERAGE(IF(F441:Z441>-1,F441:Z441)),0)","v":73085},-1,62794.054439999993,61707.234267,60258.14070299999,-1,62854.433338499992,-1,-1,80907.723989999999,-1,70039.522259999998,96485.479802999995,60560.035195499993,102161.09626199999,-1,-1,-1,-1,-1,-1,-1,null,null,"Ropa CaballeroJean informal2"]
["Ropa Caballero","Bata o blusa labor",2,null,{"$f":"ROUND(AVERAGE(IF(F442:Z442>-1,F442:Z442)),0)","v":31147},-1,11931.098188499998,31517.785016999998,31276.269422999998,-1,34778.245535999995,-1,-1,46560.105314999993,-1,31095.132727499997,21615.645662999999,30249.828148500001,41299.166574000003,-1,-1,-1,-1,-1,-1,-1,null,null,"Ropa CaballeroBata o blusa labor2"]
["Ropa Caballero","Calcetín para calzado calle",2,null,{"$f":"ROUND(AVERAGE(IF(F443:Z443>-1,F443:Z443)),0)","v":11378},-1,11303.385488999998,10988.959526999999,10868.201729999999,-1,11327.309203499999,-1,-1,11471.990714999998,-1,11049.338425499998,7124.7100229999996,10879.593975,17389.122767999997,-1,-1,-1,-1,-1,-1,-1,null,null,"Ropa CaballeroCalcetín para calzado calle2"]
["Ropa Caballero","Calcetín para calzado deportivo",2,null,{"$f":"ROUND(AVERAGE(IF(F444:Z444>-1,F444:Z444)),0)","v":11649},-1,11931.098188499998,10988.959526999999,11351.232918,-1,11327.309203499999,-1,-1,11471.990714999998,-1,11773.885207499998,7124.7100229999996,11484.5221845,17389.122767999997,-1,-1,-1,-1,-1,-1,-1,null,null,"Ropa CaballeroCalcetín para calzado deportivo2"]
["Ropa Caballero","Pantaloncillo tipo bóxer.",2,null,{"$f":"ROUND(AVERAGE(IF(F445:Z445>-1,F445:Z445)),0)","v":16396},-1,31397.027219999996,12196.537496999999,11834.264106000001,-1,11978.9456175,-1,-1,20649.583287000001,-1,11541.483409499999,8211.5301959999997,11494.775205,28257.324497999998,-1,-1,-1,-1,-1,-1,-1,null,null,"Ropa CaballeroPantaloncillo tipo bóxer.2"]
["Ropa Caballero","Gorra o cachucha",2,null,{"$f":"ROUND(AVERAGE(IF(F446:Z446>-1,F446:Z446)),0)","v":19427},-1,18838.216331999996,19442.005316999996,18113.669549999999,-1,19972.883933999998,-1,-1,20649.583287000001,-1,18475.942940999998,21615.645662999999,18168.352326,19562.763114000001,-1,-1,-1,-1,-1,-1,-1,null,null,"Ropa CaballeroGorra o cachucha2"]
["Ropa Caballero","Tula / Morral",2,null,{"$f":"ROUND(AVERAGE(IF(F447:Z447>-1,F447:Z447)),0)","v":71276},-1,71585.449906499998,70160.280056999996,70039.522259999998,-1,72515.057098499994,-1,-1,50423.215594499998,-1,75715.138718999995,66296.03055299999,69107.636618999997,95640.175223999991,-1,-1,-1,-1,-1,-1,-1,null,null,"Ropa CaballeroTula / Morral2"]
["Ropa Caballero","Logo corporativo (tamaño bolsillo)",2,null,{"$f":"ROUND(AVERAGE(IF(F448:Z448>-1,F448:Z448)),0)","v":6459},-1,6279.4054439999991,6883.1944289999992,5917.1320530000003,-1,7197.6203909999995,-1,-1,5209.6736384999995,-1,5856.7531544999993,6025.3583804999998,6068.6489114999995,8694.5613839999987,-1,-1,-1,-1,-1,-1,-1,null,null,"Ropa CaballeroLogo corporativo (tamaño bolsillo)2"]
["Ropa Caballero","Logo corporativo (tamaño espalda)",2,null,{"$f":"ROUND(AVERAGE(IF(F449:Z449>-1,F449:Z449)),0)","v":13256},-1,12558.810887999998,12196.537496999999,11955.021902999999,-1,12123.627128999999,-1,-1,25003.699325999994,-1,11713.506308999999,6387.6317714999996,12148.690068,15215.482421999999,-1,-1,-1,-1,-1,-1,-1,null,null,"Ropa CaballeroLogo corporativo (tamaño espalda)2"]
["Calzado Dama","Calzado de calle para dama.",2,null,{"$f":"ROUND(AVERAGE(IF(F450:Z450>-1,F450:Z450)),0)","v":115764},-1,-1,88273.949606999988,-1,114719.90714999998,-1,-1,-1,148978.66631399997,-1,115685.96952599999,153241.644393,88684.070426999999,106266.86135999998,-1,-1,132712.81890299998,115323.69613499999,89964.558764999994,119550.21902999999,-1,null,null,{"$f":"A450&B450&C450&D450","v":"Calzado DamaCalzado de calle para dama.2"}]
["Calzado Dama","Calzado casual para dama.",2,null,{"$f":"ROUND(AVERAGE(IF(F451:Z451>-1,F451:Z451)),0)","v":114811},-1,-1,88877.738591999994,-1,114719.90714999998,-1,-1,-1,158147.14508999998,-1,115685.96952599999,148411.332513,88597.489365000001,106266.86135999998,-1,-1,132712.81890299998,112908.54019499999,87911.676215999993,108682.01729999998,-1,null,null,"Calzado DamaCalzado casual para dama.2"]
["Calzado Dama","Calzado de calle para dama clima cálido.",2,null,{"$f":"ROUND(AVERAGE(IF(F452:Z452>-1,F452:Z452)),0)","v":112679},-1,-1,89723.043170999998,-1,114719.90714999998,-1,-1,-1,137519.20706849999,-1,118946.43004499999,132712.81890299998,90969.354773999992,106266.86135999998,-1,-1,132712.81890299998,112908.54019499999,90689.105546999985,112304.75120999999,-1,null,null,"Calzado DamaCalzado de calle para dama clima cálido.2"]
["Calzado Dama","Cinturón.",2,null,{"$f":"ROUND(AVERAGE(IF(F453:Z453>-1,F453:Z453)),0)","v":38608},-1,-1,30430.964843999998,-1,42265.228949999997,-1,-1,-1,24127.635685499998,-1,31155.511625999996,45767.205062999994,30703.239499499996,36227.339099999997,-1,-1,42144.471152999991,54341.008649999989,30769.3145205,56756.16459,-1,null,null,"Calzado DamaCinturón.2"]
["Calzado Caballero","Calzado de calle para caballero formal.",2,null,{"$f":"ROUND(AVERAGE(IF(F454:Z454>-1,F454:Z454)),0)","v":125845},-1,-1,97934.573367000005,-1,-1,-1,-1,-1,187943.56188749999,-1,132833.57669999998,153241.644393,98538.362351999982,111097.17324,-1,-1,144788.59860299999,114116.11816499999,99612.651055499984,118342.64105999999,-1,null,null,"Calzado CaballeroCalzado de calle para caballero formal.2"]
["Calzado Caballero","Calzado deportivo para caballero",2,null,{"$f":"ROUND(AVERAGE(IF(F455:Z455>-1,F455:Z455)),0)","v":121805},-1,-1,106387.61915699999,-1,-1,-1,-1,-1,148978.66631399997,-1,126795.68684999998,148411.332513,106950.39605999998,111097.17324,-1,-1,144788.59860299999,106870.65034499999,107884.56014999998,109889.59526999999,-1,null,null,"Calzado CaballeroCalzado deportivo para caballero2"]
["Calzado Caballero","Calzado casual para caballero.",2,null,{"$f":"ROUND(AVERAGE(IF(F456:Z456>-1,F456:Z456)),0)","v":122780},-1,-1,106387.61915699999,-1,-1,-1,-1,-1,171898.72402950001,-1,124380.53090999999,132712.81890299998,107055.20471399999,111097.17324,-1,-1,144788.59860299999,109285.80628499998,107884.56014999998,112304.75120999999,-1,null,null,"Calzado CaballeroCalzado casual para caballero.2"]
["Calzado Caballero","Cinturón",2,null,{"$f":"ROUND(AVERAGE(IF(F457:Z457>-1,F457:Z457)),0)","v":39604},-1,-1,29102.629076999998,-1,-1,-1,-1,-1,41255.876042999997,-1,31155.511625999996,45767.205062999994,29474.016263999998,36227.339099999997,-1,-1,42144.471152999991,54341.008649999989,29814.644389499997,56756.16459,-1,null,null,"Calzado CaballeroCinturón2"]
["Ropa Dama","Sastre formal de dos piezas para dama: chaqueta y falda o pantalón (Opción Uno).",3,null,{"$f":"ROUND(AVERAGE(IF(F458:Z458>-1,F458:Z458)),0)","v":216646},-1,-1,208307.19982499996,-1,-1,-1,-1,-1,219448.815435,-1,209394.01999799997,236685.28211999999,209394.01999799997,-1,-1,-1,-1,-1,-1,-1,-1,null,null,"Ropa DamaSastre formal de dos piezas para dama: chaqueta y falda o pantalón (Opción Uno).3"]
["Ropa Dama","Sastre formal de dos piezas para dama: chaqueta y falda o pantalón (Opción Dos).",3,null,{"$f":"ROUND(AVERAGE(IF(F459:Z459>-1,F459:Z459)),0)","v":202858},-1,-1,205892.04388499999,-1,-1,-1,-1,-1,161145.58397399998,-1,203839.16133599999,236685.28211999999,206728.23466799999,-1,-1,-1,-1,-1,-1,-1,-1,null,null,"Ropa DamaSastre formal de dos piezas para dama: chaqueta y falda o pantalón (Opción Dos).3"]
["Ropa Dama","Sastre formal de tres piezas para dama: chaqueta, chaleco y falda o pantalón.",3,null,{"$f":"ROUND(AVERAGE(IF(F460:Z460>-1,F460:Z460)),0)","v":250161},-1,-1,263855.78644499998,-1,-1,-1,-1,-1,219448.815435,-1,254436.67827899996,248761.06181999997,264302.36244899995,-1,-1,-1,-1,-1,-1,-1,-1,null,null,"Ropa DamaSastre formal de tres piezas para dama: chaqueta, chaleco y falda o pantalón.3"]
["Ropa Dama","Blazer para dama.",3,null,{"$f":"ROUND(AVERAGE(IF(F461:Z461>-1,F461:Z461)),0)","v":170870},-1,-1,190193.530275,-1,-1,-1,-1,-1,128857.68319499999,-1,192789.82291049999,152154.82421999998,190356.43937849998,-1,-1,-1,-1,-1,-1,-1,-1,null,null,"Ropa DamaBlazer para dama.3"]
["Ropa Dama","Blusa formal manga larga para dama.",3,null,{"$f":"ROUND(AVERAGE(IF(F462:Z462>-1,F462:Z462)),0)","v":64306},-1,-1,68228.155304999993,-1,-1,-1,-1,-1,47583.128915999994,-1,70401.795650999993,65933.757161999994,69384.468172499997,-1,-1,-1,-1,-1,-1,-1,-1,null,null,"Ropa DamaBlusa formal manga larga para dama.3"]
["Ropa Dama","Blusa formal manga corta para dama.",3,null,{"$f":"ROUND(AVERAGE(IF(F463:Z463>-1,F463:Z463)),0)","v":60722},-1,-1,65812.999364999996,-1,-1,-1,-1,-1,44020.773904499998,-1,67865.881913999998,59050.562732999992,66862.225129500002,-1,-1,-1,-1,-1,-1,-1,-1,null,null,"Ropa DamaBlusa formal manga corta para dama.3"]
["Ropa Dama","Blusa sport o informal para dama.",3,null,{"$f":"ROUND(AVERAGE(IF(F464:Z464>-1,F464:Z464)),0)","v":63043},-1,-1,65812.999364999996,-1,-1,-1,-1,-1,50500.682860499997,-1,67020.577334999994,65933.757161999994,65948.567080499997,-1,-1,-1,-1,-1,-1,-1,-1,null,null,"Ropa DamaBlusa sport o informal para dama.3"]
["Ropa Dama","Blusa para dama.",3,null,{"$f":"ROUND(AVERAGE(IF(F465:Z465>-1,F465:Z465)),0)","v":65465},-1,-1,70643.311245000004,-1,-1,-1,-1,-1,47583.128915999994,-1,72213.162605999998,65933.757161999994,70949.762635499996,-1,-1,-1,-1,-1,-1,-1,-1,null,null,"Ropa DamaBlusa para dama.3"]
["Ropa Dama","Chaqueta casual o sport.",3,null,{"$f":"ROUND(AVERAGE(IF(F466:Z466>-1,F466:Z466)),0)","v":116217},-1,-1,110493.384255,-1,-1,-1,-1,-1,129099.19878899999,-1,113270.81358599999,117014.30529299998,111208.81724099998,-1,-1,-1,-1,-1,-1,-1,-1,null,null,"Ropa DamaChaqueta casual o sport.3"]
["Ropa Dama","Chaqueta de jean",3,null,{"$f":"ROUND(AVERAGE(IF(F467:Z467>-1,F467:Z467)),0)","v":123774},-1,-1,137060.09959499998,-1,-1,-1,-1,-1,114599.14935299999,-1,140320.56011399999,117014.30529299998,109877.06380049999,-1,-1,-1,-1,-1,-1,-1,-1,null,null,"Ropa DamaChaqueta de jean3"]
["Ropa Dama","Falda",3,null,{"$f":"ROUND(AVERAGE(IF(F468:Z468>-1,F468:Z468)),0)","v":64545},-1,-1,67020.577334999994,-1,-1,-1,-1,-1,62190.265454999993,-1,68348.913101999991,58084.500356999997,67080.956233499994,-1,-1,-1,-1,-1,-1,-1,-1,null,null,"Ropa DamaFalda3"]
["Ropa Dama","Gabán o abrigo para dama",3,null,{"$f":"ROUND(AVERAGE(IF(F469:Z469>-1,F469:Z469)),0)","v":185228},-1,-1,209514.77779499997,-1,-1,-1,-1,-1,132474.7209825,-1,200216.42742599998,175581.83683799999,208353.90802949999,-1,-1,-1,-1,-1,-1,-1,-1,null,null,"Ropa DamaGabán o abrigo para dama3"]
["Ropa Dama","Pantalón formal",3,null,{"$f":"ROUND(AVERAGE(IF(F470:Z470>-1,F470:Z470)),0)","v":82688},-1,-1,80303.935004999992,-1,-1,-1,-1,-1,90589.993015499989,-1,82598.333148000005,79096.357034999994,80850.762764999992,-1,-1,-1,-1,-1,-1,-1,-1,null,null,"Ropa DamaPantalón formal3"]
["Ropa Dama","Pantalón drill formal",3,null,{"$f":"ROUND(AVERAGE(IF(F471:Z471>-1,F471:Z471)),0)","v":76376},-1,-1,73058.467184999987,-1,-1,-1,-1,-1,70299.26544599999,-1,70281.037853999995,95277.901832999982,72961.633102499996,-1,-1,-1,-1,-1,-1,-1,-1,null,null,"Ropa DamaPantalón drill formal3"]
["Ropa Dama","Jean clásico",3,null,{"$f":"ROUND(AVERAGE(IF(F472:Z472>-1,F472:Z472)),0)","v":67670},-1,-1,58567.531544999998,-1,-1,-1,-1,-1,66416.788349999988,-1,59775.109514999996,95277.901832999982,58311.206032499998,-1,-1,-1,-1,-1,-1,-1,-1,null,null,"Ropa DamaJean clásico3"]
["Ropa Dama","Jean informal",3,null,{"$f":"ROUND(AVERAGE(IF(F473:Z473>-1,F473:Z473)),0)","v":77862},-1,-1,70643.311245000004,-1,-1,-1,-1,-1,80907.723989999999,-1,72092.404809,95277.901832999982,70389.264181499995,-1,-1,-1,-1,-1,-1,-1,-1,null,null,"Ropa DamaJean informal3"]
["Ropa Dama","Camisa tipo polo",3,null,{"$f":"ROUND(AVERAGE(IF(F474:Z474>-1,F474:Z474)),0)","v":35259},-1,-1,29585.660264999999,-1,-1,-1,-1,-1,41048.537183999993,-1,36106.581302999999,39246.284025000001,30310.207047,-1,-1,-1,-1,-1,-1,-1,-1,null,null,"Ropa DamaCamisa tipo polo3"]
["Ropa Dama","Camiseta tipo T-shirt básica",3,null,{"$f":"ROUND(AVERAGE(IF(F475:Z475>-1,F475:Z475)),0)","v":22310},-1,-1,15094.724624999999,-1,-1,-1,-1,-1,38322.372955499995,-1,13524.873263999998,28861.113482999997,15745.221814499999,-1,-1,-1,-1,-1,-1,-1,-1,null,null,"Ropa DamaCamiseta tipo T-shirt básica3"]
["Ropa Dama","Bata o blusa labor",3,null,{"$f":"ROUND(AVERAGE(IF(F476:Z476>-1,F476:Z476)),0)","v":31447},-1,-1,30793.238235000001,-1,-1,-1,-1,-1,46560.105314999993,-1,29223.386874,20408.067692999997,30249.828148500001,-1,-1,-1,-1,-1,-1,-1,-1,null,null,"Ropa DamaBata o blusa labor3"]
["Ropa Dama","Pashmina",3,null,{"$f":"ROUND(AVERAGE(IF(F477:Z477>-1,F477:Z477)),0)","v":19496},-1,-1,24755.348384999998,-1,-1,-1,-1,-1,8334.5664419999994,-1,23427.012617999997,16785.333782999998,24175.483114499995,-1,-1,-1,-1,-1,-1,-1,-1,null,null,"Ropa DamaPashmina3"]
["Ropa Dama","Vestido",3,null,{"$f":"ROUND(AVERAGE(IF(F478:Z478>-1,F478:Z478)),0)","v":120946},-1,-1,158796.50305499998,-1,-1,-1,-1,-1,72636.954119999995,-1,161815.44798,54341.008649999989,157142.34908099999,-1,-1,-1,-1,-1,-1,-1,-1,null,null,"Ropa DamaVestido3"]
["Ropa Dama","Logo corporativo (tamaño bolsillo)",3,null,{"$f":"ROUND(AVERAGE(IF(F479:Z479>-1,F479:Z479)),0)","v":5884},-1,-1,6279.4054439999991,-1,-1,-1,-1,-1,5209.6736384999995,-1,5856.7531544999993,6025.3583804999998,6050.4213194999993,-1,-1,-1,-1,-1,-1,-1,-1,null,null,"Ropa DamaLogo corporativo (tamaño bolsillo)3"]
["Ropa Dama","Logo corporativo (tamaño espalda)",3,null,{"$f":"ROUND(AVERAGE(IF(F480:Z480>-1,F480:Z480)),0)","v":13483},-1,-1,11834.264106000001,-1,-1,-1,-1,-1,25003.699325999994,-1,11713.506308999999,6387.6317714999996,12475.647499499999,-1,-1,-1,-1,-1,-1,-1,-1,null,null,"Ropa DamaLogo corporativo (tamaño espalda)3"]
["Ropa Caballero","Vestido formal de dos piezas para hombre: saco y pantalón (Opción uno).",3,null,{"$f":"ROUND(AVERAGE(IF(F481:Z481>-1,F481:Z481)),0)","v":275335},-1,-1,233062.54820999998,-1,-1,-1,-1,-1,354216.79533599998,-1,271705.04324999999,283660.065153,234028.61058599997,-1,-1,-1,-1,-1,-1,-1,-1,null,null,"Ropa CaballeroVestido formal de dos piezas para hombre: saco y pantalón (Opción uno).3"]
["Ropa Caballero","Vestido formal de dos piezas para hombre: saco y pantalón (Opción dos).",3,null,{"$f":"ROUND(AVERAGE(IF(F482:Z482>-1,F482:Z482)),0)","v":268831},-1,-1,220986.76850999999,-1,-1,-1,-1,-1,358384.07855699991,-1,259629.26354999997,283660.065153,221493.72341249997,-1,-1,-1,-1,-1,-1,-1,-1,null,null,"Ropa CaballeroVestido formal de dos piezas para hombre: saco y pantalón (Opción dos).3"]
["Ropa Caballero","Camisa formal manga larga (Tipo uno, recomendable clima cálido).",3,null,{"$f":"ROUND(AVERAGE(IF(F483:Z483>-1,F483:Z483)),0)","v":62934},-1,-1,61586.476470000001,-1,-1,-1,-1,-1,50572.454003999992,-1,71126.342432999998,69918.764463,61465.718672999988,-1,-1,-1,-1,-1,-1,-1,-1,null,null,"Ropa CaballeroCamisa formal manga larga (Tipo uno, recomendable clima cálido).3"]
["Ropa Caballero","Camisa formal manga corta (Tipo uno, recomendable clima cálido).",3,null,{"$f":"ROUND(AVERAGE(IF(F484:Z484>-1,F484:Z484)),0)","v":58280},-1,-1,55548.586620000002,-1,-1,-1,-1,-1,44371.655050499998,-1,66296.03055299999,69918.764463,55264.919719499994,-1,-1,-1,-1,-1,-1,-1,-1,null,null,"Ropa CaballeroCamisa formal manga corta (Tipo uno, recomendable clima cálido).3"]
["Ropa Caballero","Camisa formal manga larga para caballero (Tipo dos).",3,null,{"$f":"ROUND(AVERAGE(IF(F485:Z485>-1,F485:Z485)),0)","v":64035},-1,-1,61586.476470000001,-1,-1,-1,-1,-1,56196.805360500002,-1,71126.342432999998,69918.764463,61344.96087599999,-1,-1,-1,-1,-1,-1,-1,-1,null,null,"Ropa CaballeroCamisa formal manga larga para caballero (Tipo dos).3"]
["Ropa Caballero","Camisa formal manga corta para caballero (Tipo dos).",3,null,{"$f":"ROUND(AVERAGE(IF(F486:Z486>-1,F486:Z486)),0)","v":59196},-1,-1,55548.586620000002,-1,-1,-1,-1,-1,49059.563867999997,-1,66296.03055299999,69918.764463,55156.693392000001,-1,-1,-1,-1,-1,-1,-1,-1,null,null,"Ropa CaballeroCamisa formal manga corta para caballero (Tipo dos).3"]
["Ropa Caballero","Corbata",3,null,{"$f":"ROUND(AVERAGE(IF(F487:Z487>-1,F487:Z487)),0)","v":21626},-1,-1,18113.669549999999,-1,-1,-1,-1,-1,27087.340936500001,-1,21736.403459999998,22823.223632999998,18367.716613500001,-1,-1,-1,-1,-1,-1,-1,-1,null,null,"Ropa CaballeroCorbata3"]
["Ropa Caballero","Chaqueta casual o sport.",3,null,{"$f":"ROUND(AVERAGE(IF(F488:Z488>-1,F488:Z488)),0)","v":101460},-1,-1,95398.659629999995,-1,-1,-1,-1,-1,104933.96869499999,-1,95760.933021000004,117014.30529299998,94192.220884499984,-1,-1,-1,-1,-1,-1,-1,-1,null,null,"Ropa CaballeroChaqueta casual o sport.3"]
["Ropa Caballero","Chaqueta de jean",3,null,{"$f":"ROUND(AVERAGE(IF(F489:Z489>-1,F489:Z489)),0)","v":115611},-1,-1,111097.17324,-1,-1,-1,-1,-1,128122.88339249999,-1,111942.47781899999,117014.30529299998,109877.06380049999,-1,-1,-1,-1,-1,-1,-1,-1,null,null,"Ropa CaballeroChaqueta de jean3"]
["Ropa Caballero","Chaqueta de drill",3,null,{"$f":"ROUND(AVERAGE(IF(F490:Z490>-1,F490:Z490)),0)","v":109712},-1,-1,106266.86135999998,-1,-1,-1,-1,-1,110758.82356349999,-1,108198.98611199998,117014.30529299998,106320.40491149999,-1,-1,-1,-1,-1,-1,-1,-1,null,null,"Ropa CaballeroChaqueta de drill3"]
["Ropa Caballero","Blazer para hombre.",3,null,{"$f":"ROUND(AVERAGE(IF(F491:Z491>-1,F491:Z491)),0)","v":192274},-1,-1,166645.75985999999,-1,-1,-1,-1,-1,309460.08240449999,-1,145513.14538499998,175098.80564999999,164653.25620949999,-1,-1,-1,-1,-1,-1,-1,-1,null,null,"Ropa CaballeroBlazer para hombre.3"]
["Ropa Caballero","Camisa sport o informal",3,null,{"$f":"ROUND(AVERAGE(IF(F492:Z492>-1,F492:Z492)),0)","v":62042},-1,-1,61586.476470000001,-1,-1,-1,-1,-1,56196.805360500002,-1,66416.788349999988,65088.452582999991,60922.308586499988,-1,-1,-1,-1,-1,-1,-1,-1,null,null,"Ropa CaballeroCamisa sport o informal3"]
["Ropa Caballero","Camiseta tipo t-shirt blanca",3,null,{"$f":"ROUND(AVERAGE(IF(F493:Z493>-1,F493:Z493)),0)","v":16605},-1,-1,12075.779699999999,-1,-1,-1,-1,-1,22920.057715499996,-1,13524.873263999998,23547.770414999995,10954.782792,-1,-1,-1,-1,-1,-1,-1,-1,null,null,"Ropa CaballeroCamiseta tipo t-shirt blanca3"]
["Ropa Caballero","Camiseta tipo t-shirt estampada",3,null,{"$f":"ROUND(AVERAGE(IF(F494:Z494>-1,F494:Z494)),0)","v":23633},-1,-1,14490.93564,-1,-1,-1,-1,-1,34379.516960999994,-1,31155.511625999996,23547.770414999995,14592.326620499998,-1,-1,-1,-1,-1,-1,-1,-1,null,null,"Ropa CaballeroCamiseta tipo t-shirt estampada3"]
["Ropa Caballero","Camisa tipo polo",3,null,{"$f":"ROUND(AVERAGE(IF(F495:Z495>-1,F495:Z495)),0)","v":34523},-1,-1,30189.449249999998,-1,-1,-1,-1,-1,41048.537183999993,-1,36106.581302999999,34899.003333000001,30370.585945499999,-1,-1,-1,-1,-1,-1,-1,-1,null,null,"Ropa CaballeroCamisa tipo polo3"]
["Ropa Caballero","Pantalón de dril formal",3,null,{"$f":"ROUND(AVERAGE(IF(F496:Z496>-1,F496:Z496)),0)","v":76333},-1,-1,67624.366320000001,-1,-1,-1,-1,-1,83663.508055499988,-1,68348.913101999991,95277.901832999982,66749.441903999992,-1,-1,-1,-1,-1,-1,-1,-1,null,null,"Ropa CaballeroPantalón de dril formal3"]
["Ropa Caballero","Jean clásico",3,null,{"$f":"ROUND(AVERAGE(IF(F497:Z497>-1,F497:Z497)),0)","v":67644},-1,-1,55548.586620000002,-1,-1,-1,-1,-1,66416.788349999988,-1,66416.788349999988,95277.901832999982,54558.6005295,-1,-1,-1,-1,-1,-1,-1,-1,null,null,"Ropa CaballeroJean clásico3"]
["Ropa Caballero","Jean informal",3,null,{"$f":"ROUND(AVERAGE(IF(F498:Z498>-1,F498:Z498)),0)","v":73674},-1,-1,61586.476470000001,-1,-1,-1,-1,-1,80907.723989999999,-1,70039.522259999998,95277.901832999982,60560.035195499993,-1,-1,-1,-1,-1,-1,-1,-1,null,null,"Ropa CaballeroJean informal3"]
["Ropa Caballero","Bata o blusa labor",3,null,{"$f":"ROUND(AVERAGE(IF(F499:Z499>-1,F499:Z499)),0)","v":31942},-1,-1,31397.027219999996,-1,-1,-1,-1,-1,46560.105314999993,-1,31095.132727499997,20408.067692999997,30249.828148500001,-1,-1,-1,-1,-1,-1,-1,-1,null,null,"Ropa CaballeroBata o blusa labor3"]
["Ropa Caballero","Calcetín para calzado calle",3,null,{"$f":"ROUND(AVERAGE(IF(F500:Z500>-1,F500:Z500)),0)","v":10279},-1,-1,10868.201729999999,-1,-1,-1,-1,-1,11471.990714999998,-1,11049.338425499998,7124.7100229999996,10879.593975,-1,-1,-1,-1,-1,-1,-1,-1,null,null,"Ropa CaballeroCalcetín para calzado calle3"]
["Ropa Caballero","Calcetín para calzado deportivo",3,null,{"$f":"ROUND(AVERAGE(IF(F501:Z501>-1,F501:Z501)),0)","v":10545},-1,-1,10868.201729999999,-1,-1,-1,-1,-1,11471.990714999998,-1,11773.885207499998,7124.7100229999996,11484.5221845,-1,-1,-1,-1,-1,-1,-1,-1,null,null,"Ropa CaballeroCalcetín para calzado deportivo3"]
["Ropa Caballero","Pantaloncillo tipo bóxer.",3,null,{"$f":"ROUND(AVERAGE(IF(F502:Z502>-1,F502:Z502)),0)","v":12770},-1,-1,12075.779699999999,-1,-1,-1,-1,-1,20649.583287000001,-1,11541.483409499999,8090.7723989999995,11494.775205,-1,-1,-1,-1,-1,-1,-1,-1,null,null,"Ropa CaballeroPantaloncillo tipo bóxer.3"]
["Ropa Caballero","Gorra o cachucha",3,null,{"$f":"ROUND(AVERAGE(IF(F503:Z503>-1,F503:Z503)),0)","v":19405},-1,-1,19321.247519999997,-1,-1,-1,-1,-1,20649.583287000001,-1,18475.942940999998,20408.067692999997,18168.352326,-1,-1,-1,-1,-1,-1,-1,-1,null,null,"Ropa CaballeroGorra o cachucha3"]
["Ropa Caballero","Tula / Morral",3,null,{"$f":"ROUND(AVERAGE(IF(F504:Z504>-1,F504:Z504)),0)","v":67041},-1,-1,70039.522259999998,-1,-1,-1,-1,-1,50423.215594499998,-1,75715.138718999995,69918.764463,69107.636618999997,-1,-1,-1,-1,-1,-1,-1,-1,null,null,"Ropa CaballeroTula / Morral3"]
["Ropa Caballero","Logo corporativo (tamaño bolsillo)",3,null,{"$f":"ROUND(AVERAGE(IF(F505:Z505>-1,F505:Z505)),0)","v":5985},-1,-1,6762.436631999999,-1,-1,-1,-1,-1,5209.6736384999995,-1,5856.7531544999993,6025.3583804999998,6068.6489114999995,-1,-1,-1,-1,-1,-1,-1,-1,null,null,"Ropa CaballeroLogo corporativo (tamaño bolsillo)3"]
["Ropa Caballero","Logo corporativo (tamaño espalda)",3,null,{"$f":"ROUND(AVERAGE(IF(F506:Z506>-1,F506:Z506)),0)","v":13466},-1,-1,12075.779699999999,-1,-1,-1,-1,-1,25003.699325999994,-1,11713.506308999999,6387.6317714999996,12148.690068,-1,-1,-1,-1,-1,-1,-1,-1,null,null,"Ropa CaballeroLogo corporativo (tamaño espalda)3"]
["Calzado Dama","Calzado de calle para dama.",3,null,{"$f":"ROUND(AVERAGE(IF(F507:Z507>-1,F507:Z507)),0)","v":118224},-1,-1,88153.191809999989,-1,-1,-1,-1,-1,148978.66631399997,-1,115685.96952599999,149618.91048300001,88684.070426999999,-1,-1,-1,-1,-1,-1,-1,-1,null,null,"Calzado DamaCalzado de calle para dama.3"]
["Calzado Dama","Calzado casual para dama.",3,null,{"$f":"ROUND(AVERAGE(IF(F508:Z508>-1,F508:Z508)),0)","v":119195},-1,-1,88756.980794999996,-1,-1,-1,-1,-1,158147.14508999998,-1,115685.96952599999,144788.59860299999,88597.489365000001,-1,-1,-1,-1,-1,-1,-1,-1,null,null,"Calzado DamaCalzado casual para dama.3"]
["Calzado Dama","Calzado de calle para dama clima cálido.",3,null,{"$f":"ROUND(AVERAGE(IF(F509:Z509>-1,F509:Z509)),0)","v":113467},-1,-1,89602.285373999999,-1,-1,-1,-1,-1,137519.20706849999,-1,118946.43004499999,130297.662963,90969.354773999992,-1,-1,-1,-1,-1,-1,-1,-1,null,null,"Calzado DamaCalzado de calle para dama clima cálido.3"]
["Calzado Dama","Cinturón.",3,null,{"$f":"ROUND(AVERAGE(IF(F510:Z510>-1,F510:Z510)),0)","v":32413},-1,-1,30310.207047,-1,-1,-1,-1,-1,24127.635685499998,-1,31155.511625999996,45767.205062999994,30703.239499499996,-1,-1,-1,-1,-1,-1,-1,-1,null,null,"Calzado DamaCinturón.3"]
["Calzado Caballero","Calzado de calle para caballero formal.",3,null,{"$f":"ROUND(AVERAGE(IF(F511:Z511>-1,F511:Z511)),0)","v":133350},-1,-1,97813.815569999992,-1,-1,-1,-1,-1,187943.56188749999,-1,132833.57669999998,149618.91048300001,98538.362351999982,-1,-1,-1,-1,-1,-1,-1,-1,null,null,"Calzado CaballeroCalzado de calle para caballero formal.3"]
["Calzado Caballero","Calzado deportivo para caballero",3,null,{"$f":"ROUND(AVERAGE(IF(F512:Z512>-1,F512:Z512)),0)","v":126756},-1,-1,106266.86135999998,-1,-1,-1,-1,-1,148978.66631399997,-1,126795.68684999998,144788.59860299999,106950.39605999998,-1,-1,-1,-1,-1,-1,-1,-1,null,null,"Calzado CaballeroCalzado deportivo para caballero3"]
["Calzado Caballero","Calzado casual para caballero.",3,null,{"$f":"ROUND(AVERAGE(IF(F513:Z513>-1,F513:Z513)),0)","v":127980},-1,-1,106266.86135999998,-1,-1,-1,-1,-1,171898.72402950001,-1,124380.53090999999,130297.662963,107055.20471399999,-1,-1,-1,-1,-1,-1,-1,-1,null,null,"Calzado CaballeroCalzado casual para caballero.3"]
["Calzado Caballero","Cinturón",3,null,{"$f":"ROUND(AVERAGE(IF(F514:Z514>-1,F514:Z514)),0)","v":35327},-1,-1,28981.871279999999,-1,-1,-1,-1,-1,41255.876042999997,-1,31155.511625999996,45767.205062999994,29474.016263999998,-1,-1,-1,-1,-1,-1,-1,-1,null,null,"Calzado CaballeroCinturón3"]
[]
[]
[]
[1,2,3,4,5,6,7,8,9,10,11,12,13,14,15,16,17,18,19,20,21,22,23,24,25,26,null,null,29,30,31,32,33,34,35,36,37,38,39,40,41,42,43,44,45,46,47,48,49,50,51]

{"sheet":"SolCotizacion","index":2,"n_rows":59,"n_cols":13,"rows_kept":59,"cut":false,"hidden":false,"merged":[[37,1,37,11],[19,6,19,7],[19,8,19,9],[24,1,24,2],[19,1,19,2],[19,3,19,4],[21,1,21,2],[21,3,21,4],[21,6,21,7],[21,8,21,9],[28,2,28,10],[56,5,56,6],[52,2,52,6],[53,2,53,6],[51,1,51,7],[42,1,42,3],[45,2,45,3],[45,5,45,9],[46,2,46,3],[46,5,46,9],[44,1,44,11],[46,10,46,11],[47,6,47,9],[47,10,47,11],[45,10,45,11],[9,4,9,8],[11,4,11,8],[11,1,11,3],[13,1,13,3],[13,4,13,8],[0,1,1,15],[5,1,5,3],[5,4,5,8],[5,10,5,11],[3,1,3,15],[5,12,5,15],[7,12,7,15],[9,10,9,11],[29,10,29,11],[26,2,26,10],[27,2,27,10],[7,1,7,3],[7,4,7,8],[7,10,7,11],[9,12,9,15],[26,12,26,13],[17,8,17,9],[17,6,17,7],[17,1,17,2],[17,3,17,4],[15,1,15,15],[9,1,9,3],[28,12,28,13],[54,2,54,6],[55,2,55,6],[27,12,27,13],[29,12,29,13],[39,2,39,3],[38,10,38,11],[31,1,31,11],[40,10,40,11],[39,5,39,9],[39,10,39,11],[40,6,40,9],[33,1,33,3],[35,1,35,3],[38,2,38,3],[38,5,38,9]]}
[null,"Solicitud de Cotización - Dotación"]
[]
[null,"Versión: 4","2021-12-30"]
[null,"Información de la Entidad Compradora"]
[]
[null,"Nombre de la Entidad:",null,null,"SECRETARÍA GENERAL DE LA ALCALDÍA MAYOR DE BOGOTA D.C.",null,null,null,null,null,"NIT:",null,899999061]
[]
[null,"Dirección de la Entidad:",null,null,"CARRERA 8 No. 10-65",null,null,null,null,null,"Correo de contacto:",null,"machacon@alcaldiabogota.gov.co"]
[]
[null,"Municipio:",null,null,"BOGOTA D.C.",null,null,null,null,null,"Teléfono de contacto:",null,1013]
[]
[null,"Nombre funcionario Comprador:",null,null,"LUZ KARIME FERNANDEZ CASTILLO"]
[]
[]
[]
[null,"Solicitud de Cotización"]
[]
[null,"Ley",null,"Ley 70 de 1988 o Ninguna Ley",null,null,"Tipo de Compra"]
[]
[null,"Segmento",null,"Calzado Caballero",null,null,"Zona",null,6,null,null,"No. Beneficiarios"]
[]
[null,"Categoría",null,"Categoría 1",null,{"$f":"RIGHT(D22,1)","v":"1"},"Modalidad de Entrega"]
[]
[null,"Filas a agregar o eliminar:"]
[null,1]
[]
[null,"No.","Kit / Producto",null,null,null,null,null,null,null,null,"Logo","Número de Prendas"]
[null,1,"Calzado de calle para caballero formal.",null,null,null,null,null,null,null,null,"No",90]
[null,2,"Calzado casual para caballero.",null,null,null,null,null,null,null,null,"No",8]
[null,"Si requiere agregue o elimine filas",null,null,null,null,null,null,null,null,"Total kit/vestuario",null,{"$f":"SUM(M28:M29)","v":98}]
[]
[null,"Órdenes de Entrega"]
[]
[null,"Tipo de Órdenes de Entrega",null,null,"Físico"]
[]
[]
[]
[null,"FÍSICO"]
[null,"No.","Departamento",null,"Municipio","Dirección",null,null,null,null,"Cantidad"]
[null,1,"CUNDINAMARCA",null,"BOGOTA","CARRERA 8 No. 10-65",null,null,null,null,3]
[null,null,null,null,null,null,"1. Cantidad Total Órdenes de Entrega",null,null,null,{"$f":"SUM(K39:L40)","v":3}]
[]
[null,"2. Filas a agregar o eliminar Órdenes de Entrega",null,null,1]
[]
[null,"VIRTUAL"]
[null,"No.","Ciudad",null,"Teléfono / Celular","Correo Electrónico",null,null,null,null,"Cantidad"]
[null,1]
[null,null,null,null,null,null,"1. Cantidad Total Órdenes de Entrega",null,null,null,{"$f":"SUM(K46:L47)","v":0}]
[]
[]
[]
[null,"Gravámenes adicionales (estampillas)"]
[null,"No","Descripción",null,null,null,null,"Porcentaje"]
[null,1,"Estampilla Pro-Personas Mayores",null,null,null,null,0.02]
[null,2,"Estampilla Universidad Distrital Francisco José de Caldas – 50 años",null,null,null,null,1.0999999999999999E-2]
[null,3,"Estampilla Pro-Cultura de Bogotá.",null,null,null,null,5.0000000000000001E-3]
[null,null,null,null,null,"Total porcentaje:",null,{"$f":"SUM(H54:H56)","v":3.5999999999999997E-2}]
[null,null,null,"Filas a agregar o eliminar Gravámenes:"]
[null,null,null,2]

{"sheet":"Tienda Móvil","index":3,"n_rows":11,"n_cols":19,"rows_kept":11,"cut":false,"hidden":false,"merged":[[1,1,1,19],[5,1,5,7],[5,8,5,9],[9,2,9,4],[10,2,10,4],[9,5,9,7],[10,5,10,7],[10,18,10,19],[9,18,9,19],[9,8,9,17],[10,8,10,17],[7,1,7,7],[7,8,7,9]]}
[]
[null,"Tienda Móvil"]
[]
[null,"Nota: el número de Beneficiarios debe ser superior a 60 en cada Tienda Móvil."]
[]
[null,"¿Número de días calendario que requiere la Tienda Móvil?",null,null,null,null,null,null,1]
[]
[null,"Cantidad Tiendas Móviles",null,null,null,null,null,null,1]
[]
[null,"No.","Departamento",null,null,"Municipio",null,null,"Dirección y otras indicaciones",null,null,null,null,null,null,null,null,null,"Beneficiarios por día Aprox."]
[null,1]

{"sheet":"Lugar de Entrega","index":4,"n_rows":11,"n_cols":19,"rows_kept":11,"cut":false,"hidden":false,"merged":[[1,1,1,19],[7,1,7,7],[7,8,7,9],[10,2,10,4],[10,5,10,7],[10,18,10,19],[3,1,3,19],[9,8,9,13],[10,8,10,13],[9,14,9,17],[10,14,10,17],[9,2,9,4],[9,5,9,7],[9,18,9,19]]}
[null,null,null,null,null,null,null,null,null,null,null,null,null,null,null,{"$f":"IF(SolCotizacion!M20=Q1,TRUE,FALSE)","v":false},{"$f":"SUM(S:S)","v":55}]
[null,"Lugar de entrega"]
[]
[null,"Nota: Recuerde que la dirección y el sitio de entrega debe ser uno solo para las modalidades de entrega de Punto Virtual y Catálogo de Vestuario, y debe ser la sede principal o regionales de la Entidad Compradora que haya solicitado la Dotación de Vestuario. No hace parte de las obligaciones del Proveedor, hacer entrega del Vestuario en sitios particulares definidos por los Beneficiarios. \nRecuerde que el supervisor de la Orden de Compra al momento de solicitar la dotación total, debe definir el departamento y el municipio en donde se encuentra ubicada la sede, en los campos dispuestos en el Punto Virtual del Proveedor."]
[]
[]
[]
[]
[]
[null,"No.","Departamento",null,null,"Municipio",null,null,"Dirección y otras indicaciones",null,null,null,null,null,"Nombre del Supervisor a cargo de recibir la Dotación",null,null,null,"Cantidad de Beneficiarios en la sede"]
[null,1,"CUNDINAMARCA",null,null,"BOGOTÁ ",null,null,"CARRERA 8 No. 10-65",null,null,null,null,null,"Ennis Esther Jaramillo Morato",null,null,null,55]

{"sheet":"ResumenCotizacion","index":5,"n_rows":43,"n_cols":18,"rows_kept":43,"cut":false,"hidden":false,"merged":[[17,4,17,5],[7,12,7,15],[9,1,9,3],[9,4,9,8],[9,10,9,11],[9,12,9,15],[7,1,7,3],[7,4,7,8],[7,10,7,11],[17,7,17,8],[17,10,17,11],[0,1,1,15],[3,1,3,15],[5,1,5,3],[5,4,5,8],[5,10,5,11],[5,12,5,15],[42,5,42,6],[38,2,38,6],[11,4,11,8],[15,1,15,15],[25,1,25,11],[27,2,27,3],[27,5,27,9],[27,10,27,11],[26,1,26,11],[11,1,11,3],[17,1,17,2],[30,1,30,11],[13,1,13,3],[13,4,13,8],[39,2,39,6],[37,1,37,7],[19,12,19,13],[22,10,22,11],[31,1,31,11],[32,2,32,3],[28,2,28,3],[28,5,28,9],[28,10,28,11],[20,2,20,10],[19,2,19,10],[20,12,20,13],[32,10,32,11],[32,5,32,9],[21,2,21,10],[21,12,21,13],[41,2,41,6],[22,12,22,13],[35,1,35,15],[33,2,33,3],[33,5,33,9],[33,10,33,11],[40,2,40,6]]}
[null,"Solicitud de Cotización - Dotación",null,null,null,null,null,null,null,null,null,null,null,null,null,null,null,{"$f":"H43","v":3.5999999999999997E-2}]
[]
[]
[null,"Información de la Entidad Compradora"]
[]
[null,"Nombre de la Entidad:",null,null,{"$f":"IF(SolCotizacion!E6=\"\",\"\",SolCotizacion!E6)","v":"SECRETARÍA GENERAL DE LA ALCALDÍA MAYOR DE BOGOTA D.C."},null,null,null,null,null,"NIT:",null,{"$f":"IF(SolCotizacion!M6=\"\",\"\",SolCotizacion!M6)","v":899999061}]
[]
[null,"Dirección de la Entidad:",null,null,{"$f":"IF(SolCotizacion!E8=\"\",\"\",SolCotizacion!E8)","v":"CARRERA 8 No. 10-65"},null,null,null,null,null,"Correo de contacto:",null,{"$f":"IF(SolCotizacion!M8=\"\",\"\",SolCotizacion!M8)","v":"machacon@alcaldiabogota.gov.co"}]
[]
[null,"Municipio:",null,null,{"$f":"IF(SolCotizacion!E10=\"\",\"\",SolCotizacion!E10)","v":"BOGOTA D.C."},null,null,null,null,null,"Teléfono de contacto:",null,{"$f":"IF(SolCotizacion!M10=\"\",\"\",SolCotizacion!M8)","v":"machacon@alcaldiabogota.gov.co"}]
[]
[null,"Nombre funcionario Comprador:",null,null,{"$f":"IF(SolCotizacion!E12=\"\",\"\",SolCotizacion!E12)","v":"LUZ KARIME FERNANDEZ CASTILLO"}]
[]
[]
[]
[null,"Resumen de Cotización"]
[null,null,null,null,null,null,null,null,null,{"$f":"RIGHT(J18,1)","v":"1"}]
[null,"Ley",null,{"$f":"SolCotizacion!D18","v":"Ley 70 de 1988 o Ninguna Ley"},"Segmento",null,{"$f":"SolCotizacion!D20","v":"Calzado Caballero"},"Categoría",null,{"$f":"SolCotizacion!D22","v":"Categoría 1"},"Tipo de Compra",null,{"$f":"SolCotizacion!I18","v":0},"Zona",{"$f":"IF(SolCotizacion!I20=0,\"\",SolCotizacion!I20)","v":6}]
[]
[null,"No.","Kit / Producto",null,null,null,null,null,null,null,null,"Logo","Número de Prendas",null,"Unidad","Precio unitario","Precio Maximo","Precio Total"]
[null,1,"Calzado de calle para caballero formal.",null,null,null,null,null,null,null,null,"No",90,null,"Und",98055.331163999988,{"$f":"P21/(1-R1)","v":101717.14851037343},{"$f":"$M21*$Q21","v":9154543.3659336083}]
[null,2,"Calzado casual para caballero.",null,null,null,null,null,null,null,null,"No",8,null,"Und",106508.37695399998,{"$f":"P22/(1-R1)","v":110485.86820954355},{"$f":"$M22*$Q22","v":883886.9456763484}]
[null,"Si requiere agregue o elimine filas",null,null,null,null,null,null,null,null,"Total kit/vestuario",null,{"$f":"SUM(M21:M22)","v":98},null,null,null,"Sub Total",{"$f":"SUM(R21:R22)","v":10038430.311609957}]
[null,null,null,null,null,null,null,null,null,null,null,null,null,null,null,null,"IVA",{"$f":"R23*0.19","v":1907301.759205892}]
[null,null,null,null,null,null,null,null,null,null,null,null,null,null,null,null,"Valor Total",{"$f":"SUM(R23:R24)","v":11945732.07081585}]
[null,"FÍSICO"]
[null,"Órdenes de Entrega"]
[null,"No.","Departamento",null,"Municipio","Dirección",null,null,null,null,"Cantidad"]
[null,1,"CUNDINAMARCA",null,"BOGOTA","CARRERA 8 No. 10-65",null,null,null,null,3]
[]
[null,"VIRTUAL"]
[null,"Órdenes de Entrega"]
[null,"No.","Ciudad",null,"Teléfono / Celular","Correo Electrónico",null,null,null,null,"Cantidad"]
[null,1]
[]
[null,"Gravámenes adicionales*"]
[]
[null,"Gravámenes adicionales (estampillas)"]
[null,"No","Descripción",null,null,null,null,"Porcentaje"]
[null,1,"Estampilla Pro-Personas Mayores",null,null,null,null,0.02]
[null,2,"Estampilla Universidad Distrital Francisco José de Caldas – 50 años",null,null,null,null,1.0999999999999999E-2]
[null,3,"Estampilla Pro-Cultura de Bogotá.",null,null,null,null,5.0000000000000001E-3]
[null,null,null,null,null,"Total porcentaje:",null,{"$f":"SUM(H40:H42)","v":3.5999999999999997E-2}]

{"sheet":"LISTAS","index":6,"n_rows":27,"n_cols":13,"rows_kept":27,"cut":false,"hidden":true,"merged":[]}
["Categoría1Zona","Categoría2modalidad","Categoría3modalidad","TipoCompra",null,"RopaDamaProductos","RopaCaballeroProductos","CalzadoDamaProductos","CalzadoCaballeroProductos","Ley70de1988oNingunaLeytc","Ley1861de2017tc","Ley70de1988oNingunaLeyseg","Ley1861de2017seg"]
[1,null,"Punto Virtual","Kit",null,"Bata o blusa labor","Bata o blusa labor","Calzado casual para dama.","Calzado casual para caballero.","Kit","Kit","Ropa Dama","Ropa Dama"]
[2,null,"Tienda Móvil","Vestuario Individual",null,"Blazer para dama.","Blazer para hombre.","Calzado de calle para dama clima cálido.","Calzado de calle para caballero formal.","Compra Individual",null,"Ropa Caballero","Ropa Caballero"]
[3,null,"Catálogo de Vestuario",null,null,"Blusa formal manga corta para dama.","Calcetín para calzado calle","Calzado de calle para dama.","Calzado deportivo para caballero",null,null,"Calzado Dama"]
[4,null,"Establecimiento",null,null,"Blusa formal manga larga para dama.","Calcetín para calzado deportivo","Cinturón.","Cinturón",null,null,"Calzado Caballero"]
[5,null,null,null,null,"Blusa para dama.","Camisa formal manga corta (Tipo uno, recomendable clima cálido)."]
[6,null,null,null,null,"Blusa sport o informal para dama.","Camisa formal manga corta para caballero (Tipo dos)."]
[7,null,null,null,null,"Camisa tipo polo","Camisa formal manga larga (Tipo uno, recomendable clima cálido)."]
[null,null,null,null,null,"Camiseta tipo T-shirt básica","Camisa formal manga larga para caballero (Tipo dos)."]
[null,null,null,null,null,"Chaqueta casual o sport.","Camisa sport o informal"]
["DiasTiendaMovil",null,"Proveedor",null,null,"Chaqueta de jean","Camisa tipo polo"]
[1,null,"Inversiones Sarhem de Colombia S.A.S.",null,null,"Falda","Camiseta tipo t-shirt blanca"]
[2,null,"Confecciones Paez S.A.",null,null,"Gabán o abrigo para dama","Camiseta tipo t-shirt estampada"]
[3,null,"Unión Temporal Hermanos Blanco ",null,null,"Jean clásico","Chaqueta casual o sport."]
[4,null,"Dotación Integral S.A.S. ",null,null,"Jean informal","Chaqueta de drill"]
[5,null,"Bacet Group S.A.S. ",null,null,"Logo corporativo (tamaño bolsillo)","Chaqueta de jean"]
[6,null,"Unión Temporal Calzado 2019",null,null,"Logo corporativo (tamaño espalda)","Corbata"]
[null,null,"Sparta Shoes S.A.S.",null,null,"Pantalón drill formal","Gorra o cachucha"]
[null,null,null,null,null,"Pantalón formal","Jean clásico"]
[null,null,null,null,null,"Pashmina","Jean informal"]
[null,null,null,null,null,"Sastre formal de dos piezas para dama: chaqueta y falda o pantalón (Opción Dos).","Logo corporativo (tamaño bolsillo)"]
[null,null,null,null,null,"Sastre formal de dos piezas para dama: chaqueta y falda o pantalón (Opción Uno).","Logo corporativo (tamaño espalda)"]
[null,null,null,null,null,"Sastre formal de tres piezas para dama: chaqueta, chaleco y falda o pantalón.","Pantalón de dril formal"]
[null,null,null,null,null,"Vestido","Pantaloncillo tipo bóxer."]
[null,null,null,null,null,null,"Tula / Morral"]
[null,null,null,null,null,null,"Vestido formal de dos piezas para hombre: saco y pantalón (Opción dos)."]
[null,null,null,null,null,null,"Vestido formal de dos piezas para hombre: saco y pantalón (Opción uno)."]

{"sheet":"Cotizacion","index":7,"n_rows":43,"n_cols":23,"rows_kept":43,"cut":false,"hidden":false,"merged":[[31,1,31,11],[32,2,32,3],[32,5,32,9],[28,2,28,3],[28,5,28,9],[28,10,28,11],[25,1,25,11],[30,1,30,11],[26,1,26,11],[27,10,27,11],[27,2,27,3],[27,5,27,9],[42,5,42,6],[0,1,1,15],[3,1,3,15],[5,1,5,3],[5,4,5,8],[5,10,5,11],[5,12,5,15],[7,1,7,3],[7,4,7,8],[7,10,7,11],[7,12,7,15],[9,1,9,3],[9,4,9,8],[9,10,9,11],[9,12,9,15],[11,1,11,3],[20,12,20,13],[11,4,11,8],[13,1,13,3],[13,4,13,8],[15,1,15,15],[18,1,18,2],[17,1,17,2],[18,3,18,4],[17,4,17,5],[17,7,17,8],[17,10,17,11],[20,2,20,10],[41,2,41,6],[22,2,22,10],[22,12,22,13],[21,12,21,13],[23,12,23,13],[23,10,23,11],[21,2,21,10],[39,2,39,6],[35,1,35,15],[37,1,37,7],[38,2,38,6],[32,10,32,11],[33,2,33,3],[33,5,33,9],[33,10,33,11],[40,2,40,6]]}
[null,"Solicitud de Cotización - Dotación",null,null,null,null,null,null,null,null,null,null,null,null,null,null,null,{"$f":"H43","v":3.5999999999999997E-2}]
[]
[]
[null,"Información de la Entidad Compradora"]
[]
[null,"Nombre de la Entidad:",null,null,{"$f":"IF(SolCotizacion!E6=\"\",\"\",SolCotizacion!E6)","v":"SECRETARÍA GENERAL DE LA ALCALDÍA MAYOR DE BOGOTA D.C."},null,null,null,null,null,"NIT:"]
[]
[null,"Dirección de la Entidad:",null,null,{"$f":"IF(SolCotizacion!E8=\"\",\"\",SolCotizacion!E8)","v":"CARRERA 8 No. 10-65"},null,null,null,null,null,"Correo de contacto:"]
[]
[null,"Municipio:",null,null,{"$f":"IF(SolCotizacion!E10=\"\",\"\",SolCotizacion!E10)","v":"BOGOTA D.C."},null,null,null,null,null,"Teléfono de contacto:"]
[]
[null,"Nombre funcionario Comprador:",null,null,{"$f":"IF(SolCotizacion!E12=\"\",\"\",SolCotizacion!E12)","v":"LUZ KARIME FERNANDEZ CASTILLO"}]
[]
[]
[]
[null,"Resumen de Cotización"]
[null,null,null,null,null,null,null,null,null,{"$f":"RIGHT(J18,1)","v":"1"}]
[null,"Ley",null,{"$f":"SolCotizacion!D18","v":"Ley 70 de 1988 o Ninguna Ley"},"Segmento",null,{"$f":"SolCotizacion!D20","v":"Calzado Caballero"},"Categoría",null,{"$f":"SolCotizacion!D22","v":"Categoría 1"},"Tipo de Compra",null,{"$f":"SolCotizacion!I18","v":0},"Zona",{"$f":"IF(SolCotizacion!I20=0,\"\",SolCotizacion!I20)","v":6}]
[null,"Proveedor"]
[]
[null,"No.","Kit / Producto",null,null,null,null,null,null,null,null,"Logo","Número de Prendas",null,"Unidad","Precio unitario","Precio Maximo","Descuento / Prendas Adicionales","Precio con Descuento","Precio Total","IVA","Vr IVA","Total"]
[null,1,"Calzado de calle para caballero formal.",null,null,null,null,null,null,null,null,"No",90,null,null,null,null,null,null,null,null,{"$f":"IF($U22=\"Si\",$T22*0.19,0)","v":0},{"$f":"$T22+$V22","v":0}]
[null,2,"Calzado casual para caballero.",null,null,null,null,null,null,null,null,"No",8]
[null,"Si requiere agregue o elimine filas",null,null,null,null,null,null,null,null,"Total kit/vestuario",null,{"$f":"SUM(M22:M23)","v":98},null,null,null,null,null,"Sub Total",{"$f":"SUM(T22:T23)","v":0},null,{"$f":"SUM(V$22:V22)","v":0},{"$f":"SUM(W$22:W22)","v":0}]
[]
[null,"FÍSICO"]
[null,"Órdenes de Entrega"]
[null,"No.","Departamento",null,"Municipio","Dirección",null,null,null,null,"Cantidad"]
[null,1,"CUNDINAMARCA",null,"BOGOTA","CARRERA 8 No. 10-65",null,null,null,null,3]
[]
[null,"VIRTUAL"]
[null,"Órdenes de Entrega"]
[null,"No.","Ciudad",null,"Teléfono / Celular","Correo Electrónico",null,null,null,null,"Cantidad"]
[null,1]
[]
[null,"Gravámenes adicionales*"]
[]
[null,"Gravámenes adicionales (estampillas)"]
[null,"No","Descripción",null,null,null,null,"Porcentaje"]
[null,1,"Estampilla Pro-Personas Mayores",null,null,null,null,0.02]
[null,2,"Estampilla Universidad Distrital Francisco José de Caldas – 50 años",null,null,null,null,1.0999999999999999E-2]
[null,3,"Estampilla Pro-Cultura de Bogotá.",null,null,null,null,5.0000000000000001E-3]
[null,null,null,null,null,"Total porcentaje:",null,{"$f":"SUM(H40:H42)","v":3.5999999999999997E-2}]

{"sheet":"CSV","index":8,"n_rows":3,"n_cols":8,"rows_kept":3,"cut":false,"hidden":true,"merged":[]}
["Tipo (servicio o artÃ­culo)","Cantidad","CÃ³digo de unidad de medida*","PosiciÃ³n","Precio base","Divisa","DescripciÃ³n","MercancÃ­a"]
["item",1000,"Und",null,"\"93280\"","COP","dtv03--Ley 70 de 1988 o Ninguna Ley - Calzado Caballero - Calzado casual para caballero."]
["item",1,"Und",null,"\"17723200\"","COP","dtv03--IVA"]